{"text_format":"1","workbook":"xlsx","n_sheets":14,"sheets":["Main","Teams","Progress R1-R4","Progress R5","Progress R6","Progress R7","Tally","Card Sample","Draw","Data R1-R4","Data R5","Data R6","Data R7","Tally Data"],"not_rendered":{"charts":0,"images":2,"macros":1,"external_links":1,"defined_names":12,"comments":1,"pivot_tables":0},"unopened":[],"bounds":{"document_bytes":16777216,"sheet_cells":100000,"rows_first":2000,"rows_last":500,"rows_between":2000,"halvings":0,"cell_chars":16384,"cell_head_chars":4096},"cells_cut":0,"cells_raw":0,"read":"whole","date_system":"1900"}

{"sheet":"Main","index":0,"n_rows":28,"n_cols":87,"rows_kept":28,"cut":false,"hidden":false,"merged":[[23,32,25,34],[18,33,18,34],[23,0,23,2],[58,11,58,14]]}
["ROUND 1",null,null,null,null,null,null,null,"ROUND 2",null,null,null,null,null,null,null,"ROUND 3",null,null,null,null,null,null,null,"ROUND 4",null,null,null,null,null,null,null,"TEAM","SKIP","Lead, Second, Third"]
["R1 Rink","T1","Score","Ends","T2","Score","Ends",null,"R2 Rink","T1","Score","Ends","T2","Score","Ends",null,"R3 Rink","T1","Score","Ends","T2","Score","Ends",null,"R2 Rink","T1","Score","Ends","T2","Score","Ends",null,{"$f":"Teams!E2","v":"A"},{"$f":"UPPER(Teams!D2)","v":"GREG THOMSEN"},{"$f":"Teams!A2&\", \"&Teams!B2&\", \"&Teams!C2","v":"Eddie Roberts, Steve Lane, Mick Pilcher"}]
[1,"A",null,null,"I",null,null,null,1,"H",null,null,"J",null,null,null,1,"G",null,null,"K",null,null,null,1,"F",null,null,"L",null,null,null,{"$f":"Teams!E3","v":"B"},{"$f":"UPPER(Teams!D3)","v":"DENNIS MADDEN"},{"$f":"Teams!A3&\", \"&Teams!B3&\", \"&Teams!C3","v":"Sam Campion, A Matson, C Leeson"},null,null,null,null,null,null,null,null,null,null,null,null,null,null,null,null,null,null,null,null,null,null,null,11,7,null,18,8,null,null,null,23,10,null,10,5,null,null,null,18,9,null,15,6,null,null,null,15,8,null,10,6]
[2,"B",null,null,"J",null,null,null,2,"A",null,null,"K",null,null,null,2,"H",null,null,"L",null,null,null,2,"G",null,null,"M",null,null,null,{"$f":"Teams!E4","v":"C"},{"$f":"UPPER(Teams!D4)","v":"SCOTT KINNEAR"},{"$f":"Teams!A4&\", \"&Teams!B4&\", \"&Teams!C4","v":"David Cleary, Doug Wootton, Luke Kinnear"},null,null,null,null,null,null,null,null,null,null,null,null,null,null,null,null,null,null,null,null,null,null,null,16,6,null,13,9,null,null,null,21,9,null,11,6,null,null,null,27,10,null,6,5,null,null,null,13,7,null,11,7]
[3,"C",null,null,"K",null,null,null,3,"B",null,null,"L",null,null,null,3,"A",null,null,"M",null,null,null,3,"H",null,null,"N",null,null,null,{"$f":"Teams!E5","v":"D"},{"$f":"UPPER(Teams!D5)","v":"NOEL WILSON"},{"$f":"Teams!A5&\", \"&Teams!B5&\", \"&Teams!C5","v":"Geoff Jolly, Bruce McLaughlin, Barry Paskins"},null,null,null,null,null,null,null,null,null,null,null,null,null,null,null,null,null,null,null,null,null,null,null,15,9,null,11,6,null,null,null,15,9,null,10,6,null,null,null,8,6,null,15,8,null,null,null,13,7,null,9,7]
[4,"D",null,null,"L",null,null,null,4,"C",null,null,"M",null,null,null,4,"B",null,null,"N",null,null,null,4,"A",null,null,"O",null,null,null,{"$f":"Teams!E6","v":"E"},{"$f":"UPPER(Teams!D6)","v":"GERRY BOGERT"},{"$f":"Teams!A6&\", \"&Teams!B6&\", \"&Teams!C6","v":"Kevin Tranberg, Barry Brown, Rickie Dunn"},null,null,null,null,null,null,null,null,null,null,null,null,null,null,null,null,null,null,null,null,null,null,null,14,6,null,19,9,null,null,null,15,12,null,7,3,null,null,null,9,6,null,25,9,null,null,null,26,10,null,7,5]
[5,"E",null,null,"M",null,null,null,5,"D",null,null,"N",null,null,null,5,"C",null,null,"O",null,null,null,5,"B",null,null,"P",null,null,null,{"$f":"Teams!E7","v":"F"},{"$f":"UPPER(Teams!D7)","v":"NOEL BRAND"},{"$f":"Teams!A7&\", \"&Teams!B7&\", \"&Teams!C7","v":"Dan Robinson, Jim Wallace, Adam Johnson"},null,null,null,null,null,null,null,null,null,null,null,null,null,null,null,null,null,null,null,null,null,null,null,11,8,null,13,7,null,null,null,12,5,null,21,10,null,null,null,10,6,null,11,9,null,null,null,9,6,null,21,9]
[6,"F",null,null,"N",null,null,null,6,"E",null,null,"O",null,null,null,6,"D",null,null,"P",null,null,null,6,"C",null,null,"I",null,null,null,{"$f":"Teams!E8","v":"G"},{"$f":"UPPER(Teams!D8)","v":"ROBBIE HARRIS"},{"$f":"Teams!A8&\", \"&Teams!B8&\", \"&Teams!C8","v":"Peter Taft, Alan Bennett, Brian Archer"},null,null,null,null,null,null,null,null,null,null,null,null,null,null,null,null,null,null,null,null,null,null,null,14,9,null,10,6,null,null,null,22,10,null,9,5,null,null,null,10,6,null,15,9,null,null,null,9,8,null,12,7]
[7,"G",null,null,"O",null,null,null,7,"F",null,null,"P",null,null,null,7,"E",null,null,"I",null,null,null,7,"D",null,null,"J",null,null,null,{"$f":"Teams!E9","v":"H"},{"$f":"UPPER(Teams!D9)","v":"WADE CRANSTON"},{"$f":"Teams!A9&\", \"&Teams!B9&\", \"&Teams!C9","v":"David Peet, Don Orr, Mark Glew"},null,null,null,null,null,null,null,null,null,null,null,null,null,null,null,null,null,null,null,null,null,null,null,14,8,null,10,7,null,null,null,21,10,null,10,5,null,null,null,13,7,null,17,8,null,null,null,11,6,null,16,9]
[8,"H",null,null,"P",null,null,null,8,"G",null,null,"I",null,null,null,8,"F",null,null,"J",null,null,null,8,"E",null,null,"K",null,null,null,{"$f":"Teams!E10","v":"I"},{"$f":"UPPER(Teams!D10)","v":"RAY KURTZ"},{"$f":"Teams!A10&\", \"&Teams!B10&\", \"&Teams!C10","v":"Kees Struik, Grant Edmonds, Bruce Bridger"},null,null,null,null,null,null,null,null,null,null,null,null,null,null,null,null,null,null,null,null,null,null,null,5,5,null,23,10,null,null,null,8,5,null,13,10,null,null,null,24,8,null,10,7,null,null,null,22,9,null,14,5]
["Run macro ( CRTL+s ) to update rankings",null,null,null,null,null,null,null,"Run macro ( CRTL+s ) to update rankings",null,null,null,null,null,null,null,"Run macro ( CRTL+s ) to update rankings",null,null,null,null,null,null,null,"Run macro ( CRTL+s ) to view rankings",null,null,null,null,null,null,null,{"$f":"Teams!E11","v":"J"},{"$f":"UPPER(Teams!D11)","v":"PETER BLACKBURN"},{"$f":"Teams!A11&\", \"&Teams!B11&\", \"&Teams!C11","v":"Nathan Dodds, Michael Kinnear, Graham Kinnear"}]
[null,null,null,null,null,null,null,null,null,null,null,null,null,null,null,null,null,null,null,null,null,null,null,null,null,null,null,null,null,null,null,null,{"$f":"Teams!E12","v":"K"},{"$f":"UPPER(Teams!D12)","v":"TONY WHITEHORN"},{"$f":"Teams!A12&\", \"&Teams!B12&\", \"&Teams!C12","v":"Rick Brunell, Ash Worland, Neil Moore"}]
["ROUND 5",null,null,null,null,null,null,null,"ROUND 6",null,null,null,null,null,null,null,"ROUND 7",null,null,null,null,null,null,null,null,null,null,null,null,null,null,null,{"$f":"Teams!E13","v":"L"},{"$f":"UPPER(Teams!D13)","v":"SHANE SPANN"},{"$f":"Teams!A13&\", \"&Teams!B13&\", \"&Teams!C13","v":"Gavin Milne, Jonathan Bye, Wayne Handley"}]
["R5 Rink","T1","Score","Ends","T2","Score","Ends",null,"R6 Rink","T1","Score","Ends","T2","Score","Ends",null,"R7 Rink","T1","Score","Ends","T2","Score","Ends",null,null,null,null,null,null,null,null,null,{"$f":"Teams!E14","v":"M"},{"$f":"UPPER(Teams!D14)","v":"PETER MOLLOY"},{"$f":"Teams!A14&\", \"&Teams!B14&\", \"&Teams!C14","v":"Col Stevens, Mick Coll, Steve Cassidy"}]
[1,{"$f":"Draw!Z6","v":""},null,null,{"$f":"Draw!AB6","v":""},null,null,null,1,{"$f":"Draw!AG6","v":""},null,null,{"$f":"Draw!AI6","v":""},null,null,null,1,{"$f":"Draw!AN6","v":""},null,null,{"$f":"Draw!AP6","v":""},null,null,null,null,null,null,null,null,null,null,null,{"$f":"Teams!E15","v":"N"},{"$f":"UPPER(Teams!D15)","v":"RUSSELL FRY"},{"$f":"Teams!A15&\", \"&Teams!B15&\", \"&Teams!C15","v":"Glenn Petrie, Paul Brunker, Wayne Pomfrett"},null,null,null,null,null,null,null,null,null,null,null,null,null,null,null,null,null,null,null,null,null,null,null,18,9,null,15,6,null,null,null,23,10,null,10,5,null,null,null,11,7,null,18,8]
[2,{"$f":"Draw!Z7","v":""},null,null,{"$f":"Draw!AB7","v":""},null,null,null,2,{"$f":"Draw!AG7","v":""},null,null,{"$f":"Draw!AI7","v":""},null,null,null,2,{"$f":"Draw!AN7","v":""},null,null,{"$f":"Draw!AP7","v":""},null,null,null,null,null,null,null,null,null,null,null,{"$f":"Teams!E16","v":"O"},{"$f":"UPPER(Teams!D16)","v":"MICK WALSH"},{"$f":"Teams!A16&\", \"&Teams!B16&\", \"&Teams!C16","v":"Ben Walsh, Tony Gibson, Barry Jackson"},null,null,null,null,null,null,null,null,null,null,null,null,null,null,null,null,null,null,null,null,null,null,null,27,10,null,6,5,null,null,null,21,9,null,11,6,null,null,null,16,6,null,13,9]
[3,{"$f":"Draw!Z8","v":""},null,null,{"$f":"Draw!AB8","v":""},null,null,null,3,{"$f":"Draw!AG8","v":""},null,null,{"$f":"Draw!AI8","v":""},null,null,null,3,{"$f":"Draw!AN8","v":""},null,null,{"$f":"Draw!AP8","v":""},null,null,null,null,null,null,null,null,null,null,null,{"$f":"Teams!E17","v":"P"},{"$f":"UPPER(Teams!D17)","v":"BOB KINNANE"},{"$f":"Teams!A17&\", \"&Teams!B17&\", \"&Teams!C17","v":"Wally Kleidon, Mick Miller, George MacDonald"},null,null,null,null,null,null,null,null,null,null,null,null,null,null,null,null,null,null,null,null,null,null,null,8,6,null,15,8,null,null,null,15,9,null,10,6,null,null,null,15,9,null,11,6]
[4,{"$f":"Draw!Z9","v":""},null,null,{"$f":"Draw!AB9","v":""},null,null,null,4,{"$f":"Draw!AG9","v":""},null,null,{"$f":"Draw!AI9","v":""},null,null,null,4,{"$f":"Draw!AN9","v":""},null,null,{"$f":"Draw!AP9","v":""},null,null,null,null,null,null,null,null,null,null,null,null,null,null,null,null,null,null,null,null,null,null,null,null,null,null,null,null,null,null,null,null,null,null,null,null,null,9,6,null,25,9,null,null,null,15,12,null,7,3,null,null,null,14,6,null,19,9]
[5,{"$f":"Draw!Z10","v":""},null,null,{"$f":"Draw!AB10","v":""},null,null,null,5,{"$f":"Draw!AG10","v":""},null,null,{"$f":"Draw!AI10","v":""},null,null,null,5,{"$f":"Draw!AN10","v":""},null,null,{"$f":"Draw!AP10","v":""},null,null,null,null,null,null,null,null,null,null,null,"NAME:","TOURNAMENT NAME",null,null,null,null,null,null,null,null,null,null,null,null,null,null,null,null,null,null,null,null,null,null,null,null,10,6,null,11,9,null,null,null,12,5,null,21,10,null,null,null,11,8,null,13,7]
[6,{"$f":"Draw!Z11","v":""},null,null,{"$f":"Draw!AB11","v":""},null,null,null,6,{"$f":"Draw!AG11","v":""},null,null,{"$f":"Draw!AI11","v":""},null,null,null,6,{"$f":"Draw!AN11","v":""},null,null,{"$f":"Draw!AP11","v":""},null,null,null,null,null,null,null,null,null,null,null,"Tournament format (8 rinks only)",null,null,null,null,null,null,null,null,null,null,null,null,null,null,null,null,null,null,null,null,null,null,null,null,null,10,6,null,15,9,null,null,null,22,10,null,9,5,null,null,null,14,9,null,10,6]
[7,{"$f":"Draw!Z12","v":""},null,null,{"$f":"Draw!AB12","v":""},null,null,null,7,{"$f":"Draw!AG12","v":""},null,null,{"$f":"Draw!AI12","v":""},null,null,null,7,{"$f":"Draw!AN12","v":""},null,null,{"$f":"Draw!AP12","v":""},null,null,null,"Div 1",null,null,null,null,null,null,null,"Saturday - 4 Rounds",null,null,null,null,null,null,null,null,null,null,null,null,null,null,null,null,null,null,null,null,null,null,null,null,null,13,7,null,17,8,null,null,null,21,10,null,10,5,null,null,null,14,8,null,10,7]
[8,{"$f":"Draw!Z13","v":""},null,null,{"$f":"Draw!AB13","v":""},null,null,null,8,{"$f":"Draw!AG13","v":""},null,null,{"$f":"Draw!AI13","v":""},null,null,null,8,{"$f":"Draw!AN13","v":""},null,null,{"$f":"Draw!AP13","v":""},null,null,null,"Div 2",null,null,null,null,null,null,null,"Sunday PM - DIV 1 Finals, Div 2 & Div 3 preset draw continues with best Sunday totals each Division",null,null,null,null,null,null,null,null,null,null,null,null,null,null,null,null,null,null,null,null,null,null,null,null,null,24,8,null,10,7,null,null,null,8,5,null,13,10,null,null,null,5,5,null,23,10]
["Run macro ( CRTL+d) to view rankings",null,null,null,null,null,null,null,"Run macro ( CRTL+f ) to view rankings",null,null,null,null,null,null,null,"Run macro ( CRTL+g ) to view rankings",null,null,null,null,null,null,null,"Div 3",null,null,null,null,null,null,null,"Rinks Numbers and team LETTERS are predetermined.  Teams draw for team LETTER before round 1."]
[null,null,null,null,null,null,null,null,null,null,null,null,null,null,null,null,null,null,null,null,null,null,null,null,null,null,null,null,null,null,null,null,{"$f":"AH19 & \" - Data Input\"","v":"TOURNAMENT NAME - Data Input"}]
["ONLY enter data in DATA INPUT cells.  (CRTL+a) to return to \"Main\" DATA INPUT sheet, (CRTL+SHIFT+A) to zoom to data."]
["Round 5, 6 & 7 Rink teams are accurate only after Round 4 completed"]
["Tally sheet accurate only after Round 7 completed",null,null,null,null,null,null,null,null,null,null,null,null,null,null,null,"Rounds 1-4 remaining",null,null,null,null,null,null,null,"Day 2 - Pre-set Opponents Each Division (not qualifying order)"]
["Run macro ( CRTL+t ) to View Final Tally Sheet - print 16 copies",null,null,null,null,null,null,null,null,null,null,null,null,null,null,null,{"$f":"IF(ISBLANK(C3),4,IF(ISBLANK(K3),3,IF(ISBLANK(S3),2,IF(ISBLANK(AA3),1,0))))","v":4}]

{"sheet":"Teams","index":1,"n_rows":59,"n_cols":13,"rows_kept":59,"cut":false,"hidden":false,"merged":[[8,5,9,5]]}
["LEAD","SECOND","THIRD","SKIP"]
["Eddie Roberts","Steve Lane","Mick Pilcher","Greg Thomsen","A","<= Enter drawn team LETTER here (A-P)"]
["Sam Campion","A Matson","C Leeson","Dennis Madden","B","Correct all player names, order and spelling (don't drag names - retype)"]
["David Cleary","Doug Wootton","Luke Kinnear","Scott Kinnear","C"]
["Geoff Jolly","Bruce McLaughlin","Barry Paskins","Noel Wilson","D","Run macro ( CRTL+h ) to sort teams after all team LETTERS decided"]
["Kevin Tranberg","Barry Brown","Rickie Dunn","Gerry Bogert","E","Then check \"Main\" Sheet"]
["Dan Robinson","Jim Wallace","Adam Johnson","Noel Brand","F"]
["Peter Taft","Alan Bennett","Brian Archer","Robbie Harris","G"]
["David Peet","Don Orr","Mark Glew","Wade Cranston","H","Print player name check sheet when all teams known and have ready for checking by all teams.  Print area set. (CRTL+p)"]
["Kees Struik","Grant Edmonds","Bruce Bridger","Ray Kurtz","I"]
["Nathan Dodds","Michael Kinnear","Graham Kinnear","Peter Blackburn","J"]
["Rick Brunell","Ash Worland","Neil Moore","Tony Whitehorn","K"]
["Gavin Milne","Jonathan Bye","Wayne Handley","Shane Spann","L"]
["Col Stevens","Mick Coll","Steve Cassidy","Peter Molloy","M"]
["Glenn Petrie","Paul Brunker","Wayne Pomfrett","Russell Fry","N","Paste Names from \"Details of Acceptance\" document into cell A2"]
["Ben Walsh","Tony Gibson","Barry Jackson","Mick Walsh","O","prior to start of tournament"]
["Wally Kleidon","Mick Miller","George MacDonald","Bob Kinnane","P"]
[null,null,null,null,{"$f":"COUNTIF(E2:E17,E2)<2","v":true},"Must be TRUE (unique team letter test)"]
[null,null,null,null,null,null,null,{"$f":" Main!AH19& \" - Player Check to be completed by all skips before start of round 1\"","v":"TOURNAMENT NAME - Player Check to be completed by all skips before start of round 1"}]
[]
[null,null,null,null,null,null,null,{"$f":"A2","v":"Eddie Roberts"},"Lead",null,null,{"$f":"A10","v":"Kees Struik"},"Lead"]
[null,null,null,null,null,null,null,{"$f":"B2","v":"Steve Lane"},"2nd",null,null,{"$f":"B10","v":"Grant Edmonds"},"2nd"]
[null,null,null,null,null,null,null,{"$f":"C2","v":"Mick Pilcher"},"3rd",null,null,{"$f":"C10","v":"Bruce Bridger"},"3rd"]
[null,null,null,null,null,null,null,{"$f":"D2","v":"Greg Thomsen"},"Skip",null,null,{"$f":"D10","v":"Ray Kurtz"},"Skip"]
[]
[null,null,null,null,null,null,null,{"$f":"A3","v":"Sam Campion"},"Lead",null,null,{"$f":"A11","v":"Nathan Dodds"},"Lead"]
[null,null,null,null,null,null,null,{"$f":"B3","v":"A Matson"},"2nd",null,null,{"$f":"B11","v":"Michael Kinnear"},"2nd"]
[null,null,null,null,null,null,null,{"$f":"C3","v":"C Leeson"},"3rd",null,null,{"$f":"C11","v":"Graham Kinnear"},"3rd"]
[null,null,null,null,null,null,null,{"$f":"D3","v":"Dennis Madden"},"Skip",null,null,{"$f":"D11","v":"Peter Blackburn"},"Skip"]
[]
[null,null,null,null,null,null,null,{"$f":"A4","v":"David Cleary"},"Lead",null,null,{"$f":"A12","v":"Rick Brunell"},"Lead"]
[null,null,null,null,null,null,null,{"$f":"B4","v":"Doug Wootton"},"2nd",null,null,{"$f":"B12","v":"Ash Worland"},"2nd"]
[null,null,null,null,"A",null,null,{"$f":"C4","v":"Luke Kinnear"},"3rd",null,null,{"$f":"C12","v":"Neil Moore"},"3rd"]
[null,null,null,null,"B",null,null,{"$f":"D4","v":"Scott Kinnear"},"Skip",null,null,{"$f":"D12","v":"Tony Whitehorn"},"Skip"]
[null,null,null,null,"C"]
[null,null,null,null,"D",null,null,{"$f":"A5","v":"Geoff Jolly"},"Lead",null,null,{"$f":"A13","v":"Gavin Milne"},"Lead"]
[null,null,null,null,"E",null,null,{"$f":"B5","v":"Bruce McLaughlin"},"2nd",null,null,{"$f":"B13","v":"Jonathan Bye"},"2nd"]
[null,null,null,null,"F",null,null,{"$f":"C5","v":"Barry Paskins"},"3rd",null,null,{"$f":"C13","v":"Wayne Handley"},"3rd"]
[null,null,null,null,"G",null,null,{"$f":"D5","v":"Noel Wilson"},"Skip",null,null,{"$f":"D13","v":"Shane Spann"},"Skip"]
[null,null,null,null,"H"]
[null,null,null,null,"I",null,null,{"$f":"A6","v":"Kevin Tranberg"},"Lead",null,null,{"$f":"A14","v":"Col Stevens"},"Lead"]
[null,null,null,null,"J",null,null,{"$f":"B6","v":"Barry Brown"},"2nd",null,null,{"$f":"B14","v":"Mick Coll"},"2nd"]
[null,null,null,null,"K",null,null,{"$f":"C6","v":"Rickie Dunn"},"3rd",null,null,{"$f":"C14","v":"Steve Cassidy"},"3rd"]
[null,null,null,null,"L",null,null,{"$f":"D6","v":"Gerry Bogert"},"Skip",null,null,{"$f":"D14","v":"Peter Molloy"},"Skip"]
[null,null,null,null,"M"]
[null,null,null,null,"N",null,null,{"$f":"A7","v":"Dan Robinson"},"Lead",null,null,{"$f":"A15","v":"Glenn Petrie"},"Lead"]
[null,null,null,null,"O",null,null,{"$f":"B7","v":"Jim Wallace"},"2nd",null,null,{"$f":"B15","v":"Paul Brunker"},"2nd"]
[null,null,null,null,"P",null,null,{"$f":"C7","v":"Adam Johnson"},"3rd",null,null,{"$f":"C15","v":"Wayne Pomfrett"},"3rd"]
[null,null,null,null,null,null,null,{"$f":"D7","v":"Noel Brand"},"Skip",null,null,{"$f":"D15","v":"Russell Fry"},"Skip"]
[]
[null,null,null,null,null,null,null,{"$f":"A8","v":"Peter Taft"},"Lead",null,null,{"$f":"A16","v":"Ben Walsh"},"Lead"]
[null,null,null,null,null,null,null,{"$f":"B8","v":"Alan Bennett"},"2nd",null,null,{"$f":"B16","v":"Tony Gibson"},"2nd"]
[null,null,null,null,null,null,null,{"$f":"C8","v":"Brian Archer"},"3rd",null,null,{"$f":"C16","v":"Barry Jackson"},"3rd"]
[null,null,null,null,null,null,null,{"$f":"D8","v":"Robbie Harris"},"Skip",null,null,{"$f":"D16","v":"Mick Walsh"},"Skip"]
[]
[null,null,null,null,null,null,null,{"$f":"A9","v":"David Peet"},"Lead",null,null,{"$f":"A17","v":"Wally Kleidon"},"Lead"]
[null,null,null,null,null,null,null,{"$f":"B9","v":"Don Orr"},"2nd",null,null,{"$f":"B17","v":"Mick Miller"},"2nd"]
[null,null,null,null,null,null,null,{"$f":"C9","v":"Mark Glew"},"3rd",null,null,{"$f":"C17","v":"George MacDonald"},"3rd"]
[null,null,null,null,null,null,null,{"$f":"D9","v":"Wade Cranston"},"Skip",null,null,{"$f":"D17","v":"Bob Kinnane"},"Skip"]

{"sheet":"Progress R1-R4","index":2,"n_rows":70,"n_cols":16,"rows_kept":70,"cut":false,"hidden":false,"merged":[[69,15,69,18]]}
[{"$f":" Main!AH19& \" - Progress Scores after Round \" & 4-Main!Q28 &\" - DAY 1\"","v":"TOURNAMENT NAME - Progress Scores after Round 0 - DAY 1"}]
["DIVISION","RANK","TEAM","Lead, Second, Third","SKIP","POINTS","Margin","Ends"]
["FIRST",1,{"$f":"'Data R1-R4'!A7","v":"F"},{"$f":"'Data R1-R4'!B7","v":"Dan Robinson, Jim Wallace, Adam Johnson"},{"$f":"'Data R1-R4'!C7","v":"NOEL BRAND"},{"$f":"'Data R1-R4'!D7","v":0},{"$f":"'Data R1-R4'!E7","v":0},{"$f":"'Data R1-R4'!F7","v":0}]
[null,2,{"$f":"'Data R1-R4'!A10","v":"I"},{"$f":"'Data R1-R4'!B10","v":"Kees Struik, Grant Edmonds, Bruce Bridger"},{"$f":"'Data R1-R4'!C10","v":"RAY KURTZ"},{"$f":"'Data R1-R4'!D10","v":0},{"$f":"'Data R1-R4'!E10","v":0},{"$f":"'Data R1-R4'!F10","v":0}]
[null,3,{"$f":"'Data R1-R4'!A17","v":"P"},{"$f":"'Data R1-R4'!B17","v":"Wally Kleidon, Mick Miller, George MacDonald"},{"$f":"'Data R1-R4'!C17","v":"BOB KINNANE"},{"$f":"'Data R1-R4'!D17","v":0},{"$f":"'Data R1-R4'!E17","v":0},{"$f":"'Data R1-R4'!F17","v":0}]
[null,4,{"$f":"'Data R1-R4'!A9","v":"H"},{"$f":"'Data R1-R4'!B9","v":"David Peet, Don Orr, Mark Glew"},{"$f":"'Data R1-R4'!C9","v":"WADE CRANSTON"},{"$f":"'Data R1-R4'!D9","v":0},{"$f":"'Data R1-R4'!E9","v":0},{"$f":"'Data R1-R4'!F9","v":0}]
[null,5,{"$f":"'Data R1-R4'!A8","v":"G"},{"$f":"'Data R1-R4'!B8","v":"Peter Taft, Alan Bennett, Brian Archer"},{"$f":"'Data R1-R4'!C8","v":"ROBBIE HARRIS"},{"$f":"'Data R1-R4'!D8","v":0},{"$f":"'Data R1-R4'!E8","v":0},{"$f":"'Data R1-R4'!F8","v":0}]
[null,6,{"$f":"'Data R1-R4'!A15","v":"N"},{"$f":"'Data R1-R4'!B15","v":"Glenn Petrie, Paul Brunker, Wayne Pomfrett"},{"$f":"'Data R1-R4'!C15","v":"RUSSELL FRY"},{"$f":"'Data R1-R4'!D15","v":0},{"$f":"'Data R1-R4'!E15","v":0},{"$f":"'Data R1-R4'!F15","v":0}]
["SECOND",7,{"$f":"'Data R1-R4'!A6","v":"E"},{"$f":"'Data R1-R4'!B6","v":"Kevin Tranberg, Barry Brown, Rickie Dunn"},{"$f":"'Data R1-R4'!C6","v":"GERRY BOGERT"},{"$f":"'Data R1-R4'!D6","v":0},{"$f":"'Data R1-R4'!E6","v":0},{"$f":"'Data R1-R4'!F6","v":0}]
[null,8,{"$f":"'Data R1-R4'!A2","v":"A"},{"$f":"'Data R1-R4'!B2","v":"Eddie Roberts, Steve Lane, Mick Pilcher"},{"$f":"'Data R1-R4'!C2","v":"GREG THOMSEN"},{"$f":"'Data R1-R4'!D2","v":0},{"$f":"'Data R1-R4'!E2","v":0},{"$f":"'Data R1-R4'!F2","v":0}]
[null,9,{"$f":"'Data R1-R4'!A4","v":"C"},{"$f":"'Data R1-R4'!B4","v":"David Cleary, Doug Wootton, Luke Kinnear"},{"$f":"'Data R1-R4'!C4","v":"SCOTT KINNEAR"},{"$f":"'Data R1-R4'!D4","v":0},{"$f":"'Data R1-R4'!E4","v":0},{"$f":"'Data R1-R4'!F4","v":0}]
[null,10,{"$f":"'Data R1-R4'!A14","v":"M"},{"$f":"'Data R1-R4'!B14","v":"Col Stevens, Mick Coll, Steve Cassidy"},{"$f":"'Data R1-R4'!C14","v":"PETER MOLLOY"},{"$f":"'Data R1-R4'!D14","v":0},{"$f":"'Data R1-R4'!E14","v":0},{"$f":"'Data R1-R4'!F14","v":0}]
[null,11,{"$f":"'Data R1-R4'!A3","v":"B"},{"$f":"'Data R1-R4'!B3","v":"Sam Campion, A Matson, C Leeson"},{"$f":"'Data R1-R4'!C3","v":"DENNIS MADDEN"},{"$f":"'Data R1-R4'!D3","v":0},{"$f":"'Data R1-R4'!E3","v":0},{"$f":"'Data R1-R4'!F3","v":0}]
[null,12,{"$f":"'Data R1-R4'!A11","v":"J"},{"$f":"'Data R1-R4'!B11","v":"Nathan Dodds, Michael Kinnear, Graham Kinnear"},{"$f":"'Data R1-R4'!C11","v":"PETER BLACKBURN"},{"$f":"'Data R1-R4'!D11","v":0},{"$f":"'Data R1-R4'!E11","v":0},{"$f":"'Data R1-R4'!F11","v":0}]
["THIRD",13,{"$f":"'Data R1-R4'!A13","v":"L"},{"$f":"'Data R1-R4'!B13","v":"Gavin Milne, Jonathan Bye, Wayne Handley"},{"$f":"'Data R1-R4'!C13","v":"SHANE SPANN"},{"$f":"'Data R1-R4'!D13","v":0},{"$f":"'Data R1-R4'!E13","v":0},{"$f":"'Data R1-R4'!F13","v":0}]
[null,14,{"$f":"'Data R1-R4'!A16","v":"O"},{"$f":"'Data R1-R4'!B16","v":"Ben Walsh, Tony Gibson, Barry Jackson"},{"$f":"'Data R1-R4'!C16","v":"MICK WALSH"},{"$f":"'Data R1-R4'!D16","v":0},{"$f":"'Data R1-R4'!E16","v":0},{"$f":"'Data R1-R4'!F16","v":0}]
[null,15,{"$f":"'Data R1-R4'!A5","v":"D"},{"$f":"'Data R1-R4'!B5","v":"Geoff Jolly, Bruce McLaughlin, Barry Paskins"},{"$f":"'Data R1-R4'!C5","v":"NOEL WILSON"},{"$f":"'Data R1-R4'!D5","v":0},{"$f":"'Data R1-R4'!E5","v":0},{"$f":"'Data R1-R4'!F5","v":0}]
[null,16,{"$f":"'Data R1-R4'!A12","v":"K"},{"$f":"'Data R1-R4'!B12","v":"Rick Brunell, Ash Worland, Neil Moore"},{"$f":"'Data R1-R4'!C12","v":"TONY WHITEHORN"},{"$f":"'Data R1-R4'!D12","v":0},{"$f":"'Data R1-R4'!E12","v":0},{"$f":"'Data R1-R4'!F12","v":0}]
[]
[]
[]
[]
[]
[]
[]
[]
[]
[]
[]
[]
[]
[]
[]
[]
[]
[]
[]
[]
[]
[]
[]
[]
[]
[]
[]
[]
[]
[]
[]
[]
[]
[]
[]
[]
[]
[]
[]
[]
[]
[]
[]
[]
[]
[]
[]
[]
[]
[]
[]
[null,null,null,null,null,null,null,null,null,null,null,null,null,null,null,"Players for Pasting to Draw Maker"]

{"sheet":"Progress R5","index":3,"n_rows":18,"n_cols":8,"rows_kept":18,"cut":false,"hidden":false,"merged":[]}
[{"$f":" Main!AH19& \" - after ROUND 5 - Day 2\"","v":"TOURNAMENT NAME - after ROUND 5 - Day 2"}]
["DIVISION","RANK",{"$f":"'Data R1-R4'!A1","v":"TEAM"},"Lead, Second, Third","SKIP","Points","Margin","Ends"]
["FIRST",1,"I","Kees Struik, Grant Edmonds, Bruce Bridger","RAY KURTZ",3,21,10]
[null,2,"H","David Peet, Don Orr, Mark Glew","WADE CRANSTON",3,16,9]
[null,3,"N","Glenn Petrie, Paul Brunker, Wayne Pomfrett","RUSSELL FRY",3,5,9]
[null,4,"P","Wally Kleidon, Mick Miller, George MacDonald","BOB KINNANE",0,-5,6]
[null,5,"F","Dan Robinson, Jim Wallace, Adam Johnson","NOEL BRAND",0,-16,6]
[null,6,"G","Peter Taft, Alan Bennett, Brian Archer","ROBBIE HARRIS",0,-21,5]
["SECOND",1,"B","Sam Campion, A Matson, C Leeson","DENNIS MADDEN",3,7,8]
[null,2,"M","Col Stevens, Mick Coll, Steve Cassidy","PETER MOLLOY",3,4,8]
[null,3,"J","Nathan Dodds, Michael Kinnear, Graham Kinnear","PETER BLACKBURN",3,1,9]
[null,4,"C","David Cleary, Doug Wootton, Luke Kinnear","SCOTT KINNEAR",0,-1,6]
[null,5,"E","Kevin Tranberg, Barry Brown, Rickie Dunn","GERRY BOGERT",0,-4,7]
[null,6,"A","Eddie Roberts, Steve Lane, Mick Pilcher","GREG THOMSEN",0,-7,6]
["THIRD",1,"D","Geoff Jolly, Bruce McLaughlin, Barry Paskins","NOEL WILSON",3,14,8]
[null,2,"L","Gavin Milne, Jonathan Bye, Wayne Handley","SHANE SPANN",3,3,9]
[null,3,"O","Ben Walsh, Tony Gibson, Barry Jackson","MICK WALSH",0,-3,6]
[null,4,"K","Rick Brunell, Ash Worland, Neil Moore","TONY WHITEHORN",0,-14,7]

{"sheet":"Progress R6","index":4,"n_rows":18,"n_cols":11,"rows_kept":18,"cut":false,"hidden":false,"merged":[]}
[{"$f":" Main!AH19& \" - after ROUND 6 - DAY 2\"","v":"TOURNAMENT NAME - after ROUND 6 - DAY 2"}]
["DIVISION","RANK",{"$f":"'Data R1-R4'!A1","v":"TEAM"},"Lead, Second, Third","SKIP","R6 Points","R6 Margin","R6 Ends","Total Points","Total Margin","Total Ends"]
["FIRST",1,"I","Kees Struik, Grant Edmonds, Bruce Bridger","RAY KURTZ",0,-13,5,3,8,15]
[null,2,"P","Wally Kleidon, Mick Miller, George MacDonald","BOB KINNANE",3,11,10,3,6,16]
[null,3,"H","David Peet, Don Orr, Mark Glew","WADE CRANSTON",0,-11,5,3,5,14]
[null,4,"F","Dan Robinson, Jim Wallace, Adam Johnson","NOEL BRAND",3,13,10,3,-3,16]
[null,5,"N","Glenn Petrie, Paul Brunker, Wayne Pomfrett","RUSSELL FRY",0,-8,3,3,-3,12]
[null,6,"G","Peter Taft, Alan Bennett, Brian Archer","ROBBIE HARRIS",3,8,12,3,-13,17]
["SECOND",7,"B","Sam Campion, A Matson, C Leeson","DENNIS MADDEN",3,13,10,6,20,18]
[null,8,"M","Col Stevens, Mick Coll, Steve Cassidy","PETER MOLLOY",3,5,10,6,9,18]
[null,9,"A","Eddie Roberts, Steve Lane, Mick Pilcher","GREG THOMSEN",3,9,10,3,2,16]
[null,10,"J","Nathan Dodds, Michael Kinnear, Graham Kinnear","PETER BLACKBURN",0,-13,5,3,-12,14]
[null,11,"C","David Cleary, Doug Wootton, Luke Kinnear","SCOTT KINNEAR",0,-5,5,0,-6,11]
[null,12,"E","Kevin Tranberg, Barry Brown, Rickie Dunn","GERRY BOGERT",0,-9,5,0,-13,12]
["THIRD",13,"L","Gavin Milne, Jonathan Bye, Wayne Handley","SHANE SPANN",3,5,9,6,8,18]
[null,14,"D","Geoff Jolly, Bruce McLaughlin, Barry Paskins","NOEL WILSON",0,-5,6,3,9,14]
[null,15,"O","Ben Walsh, Tony Gibson, Barry Jackson","MICK WALSH",3,10,9,3,7,15]
[null,16,"K","Rick Brunell, Ash Worland, Neil Moore","TONY WHITEHORN",0,-10,6,0,-24,13]

{"sheet":"Progress R7","index":5,"n_rows":18,"n_cols":11,"rows_kept":18,"cut":false,"hidden":false,"merged":[]}
[{"$f":" Main!AH19& \" - after ROUND 7 - DAY 7 - FINAL RESULT\"","v":"TOURNAMENT NAME - after ROUND 7 - DAY 7 - FINAL RESULT"}]
["DIVISION","RANK",{"$f":"'Data R1-R4'!A1","v":"TEAM"},"Lead, Second, Third","SKIP","R7 Points","R7 Margin","R7 Ends","Total Points","Total Margin","Total Ends"]
["FIRST",1,"P","Wally Kleidon, Mick Miller, George MacDonald","BOB KINNANE",3,5,9,6,11,25]
[null,2,"H","David Peet, Don Orr, Mark Glew","WADE CRANSTON",3,4,9,6,9,23]
[null,3,"F","Dan Robinson, Jim Wallace, Adam Johnson","NOEL BRAND",3,3,6,6,0,22]
[null,4,"I","Kees Struik, Grant Edmonds, Bruce Bridger","RAY KURTZ",0,-5,6,3,3,21]
[null,5,"N","Glenn Petrie, Paul Brunker, Wayne Pomfrett","RUSSELL FRY",0,-3,9,3,-6,21]
[null,6,"G","Peter Taft, Alan Bennett, Brian Archer","ROBBIE HARRIS",0,-4,6,3,-17,23]
["SECOND",7,"B","Sam Campion, A Matson, C Leeson","DENNIS MADDEN",3,2,7,9,22,25]
[null,8,"M","Col Stevens, Mick Coll, Steve Cassidy","PETER MOLLOY",0,-2,8,6,7,26]
[null,9,"A","Eddie Roberts, Steve Lane, Mick Pilcher","GREG THOMSEN",3,4,8,6,6,24]
[null,10,"E","Kevin Tranberg, Barry Brown, Rickie Dunn","GERRY BOGERT",3,4,9,3,-9,21]
[null,11,"J","Nathan Dodds, Michael Kinnear, Graham Kinnear","PETER BLACKBURN",0,-4,6,3,-16,20]
[null,12,"C","David Cleary, Doug Wootton, Luke Kinnear","SCOTT KINNEAR",0,-4,7,0,-10,18]
["THIRD",13,"D","Geoff Jolly, Bruce McLaughlin, Barry Paskins","NOEL WILSON",3,7,8,6,16,22]
[null,14,"L","Gavin Milne, Jonathan Bye, Wayne Handley","SHANE SPANN",0,-18,5,6,-10,23]
[null,15,"O","Ben Walsh, Tony Gibson, Barry Jackson","MICK WALSH",0,-7,7,3,0,22]
[null,16,"K","Rick Brunell, Ash Worland, Neil Moore","TONY WHITEHORN",3,18,10,3,-6,23]

{"sheet":"Tally","index":6,"n_rows":24,"n_cols":64,"rows_kept":24,"cut":false,"hidden":false,"merged":[[16,63,19,63],[2,45,2,52],[2,53,2,62],[1,1,1,63],[21,36,21,37],[4,63,9,63],[10,63,15,63],[22,36,22,37],[23,36,23,37],[2,26,2,34],[2,36,2,42],[2,2,2,7],[2,17,2,25],[2,8,2,16]]}
[]
[null,{"$f":"Main!AH19 & \" - DETAILED RESULTS\"","v":"TOURNAMENT NAME - DETAILED RESULTS"}]
[null,null,"ROUND 1",null,null,null,null,null,"ROUND 2",null,null,null,null,null,null,null,null,"ROUND 3",null,null,null,null,null,null,null,null,"ROUND 4",null,null,null,null,null,null,null,null,null,"ROUND 5",null,null,null,null,null,null,null,null,"ROUND 6",null,null,null,null,null,null,null,"ROUND 7"]
[" Final Rank"," SKIP"," TEAM"," R1 v team"," Points"," Margin"," Ends "," Rank"," R2 v team"," Points"," Margin"," Ends "," Rank"," Total Points"," Total Margin"," Total Ends"," Over All Rank"," R3 v team"," Points"," Margin"," Ends "," Rank"," Total Points"," Total Margin"," Total Ends"," Over All Rank"," R4 v team"," Points"," Margin"," Ends "," Rank"," Total Points"," Total Margin"," Total Ends"," Over All Rank"," "," R5 DIVISION"," R5 TEAM"," R5 v team"," Points"," Margin"," Ends "," Rank"," R6 DIVISION"," R6 TEAM"," R6 v team"," Points"," Margin"," Ends "," Total Points"," Total Margin"," Total Ends "," Rank"," R7 DIVISION"," R7 TEAM"," R7 v team"," Points"," Margin"," Ends "," Total Points"," Total Margin"," Total Ends "," Final Rank"]
[1," BOB KINNANE","P","H",3,18,10,1,"F",0,-11,5,14,3,7,15,6,"D",3,5,9,5,6,12,24,5,"B",3,12,9,2,9,24,33,3,null,1,"P","N",0,-5,6,4,1,"P","H",3,11,10,3,6,16,2,1,"P","I",3,5,9,6,11,25,1,"DIVISION 1"]
[2," WADE CRANSTON","H","P",0,-18,5,16,"J",3,13,10,1,3,-5,15,11,"L",3,21,10,1,6,16,25,4,"N",3,4,7,6,9,20,32,4,null,1,"H","F",3,16,9,2,1,"H","P",0,-11,5,3,5,14,3,1,"H","G",3,4,9,6,9,23,2]
[3," NOEL BRAND","F","N",3,4,9,4,"P",3,11,10,3,6,15,19,1,"J",3,14,8,3,9,29,27,1,"L",3,5,8,5,12,34,35,1,null,1,"F","H",0,-16,6,5,1,"F","I",3,13,10,3,-3,16,4,1,"F","N",3,3,6,6,0,22,3]
[4," RAY KURTZ","I","A",3,7,8,2,"G",3,5,10,7,6,12,18,3,"E",3,4,8,6,9,16,26,2,"C",3,3,7,7,12,19,33,2,null,1,"I","G",3,21,10,1,1,"I","F",0,-13,5,3,8,15,1,1,"I","P",0,-5,6,3,3,21,4]
[5," RUSSELL FRY","N","F",0,-4,6,12,"D",3,9,10,5,3,5,16,7,"B",3,16,9,2,6,21,25,3,"H",0,-4,7,11,6,17,32,6,null,1,"N","P",3,5,9,3,1,"N","G",0,-8,3,3,-3,12,5,1,"N","F",0,-3,9,3,-6,21,5]
[6," ROBBIE HARRIS","G","O",3,4,8,6,"I",0,-5,5,10,3,-1,13,10,"K",3,3,9,7,6,2,22,7,"M",3,2,7,8,9,4,29,5,null,1,"G","I",0,-21,5,6,1,"G","N",3,8,12,3,-13,17,6,1,"G","H",0,-4,6,3,-17,23,6]
[7," DENNIS MADDEN","B","J",3,3,6,7,"L",3,5,9,8,6,8,15,4,"N",0,-16,6,15,6,-8,21,9,"P",0,-12,6,15,6,-20,27,11,null,2,"B","A",3,7,8,7,2,"B","J",3,13,10,6,20,18,7,2,"B","M",3,2,7,9,22,25,7,"DIVISION 2"]
[8," PETER MOLLOY","M","E",3,2,7,8,"C",0,-8,3,11,3,-6,10,12,"A",3,7,8,4,6,1,18,8,"G",0,-2,7,9,6,-1,25,10,null,2,"M","E",3,4,8,8,2,"M","C",3,5,10,6,9,18,8,2,"M","B",0,-2,8,6,7,26,8]
[9," GREG THOMSEN","A","I",0,-7,7,15,"K",3,10,9,4,3,3,16,8,"M",0,-7,6,13,3,-4,22,11,"O",3,19,10,1,6,15,32,8,null,2,"A","B",0,-7,6,10,2,"A","E",3,9,10,3,2,16,9,2,"A","C",3,4,8,6,6,24,9]
[10," GERRY BOGERT","E","M",0,-2,8,9,"O",3,13,10,1,3,11,18,5,"I",0,-4,7,11,3,7,25,10,"K",3,8,9,3,6,15,34,7,null,2,"E","M",0,-4,7,11,2,"E","A",0,-9,5,0,-13,12,10,2,"E","J",3,4,9,3,-9,21,10]
[11," PETER BLACKBURN","J","B",0,-3,9,10,"H",0,-13,5,15,0,-16,14,15,"F",0,-14,7,14,0,-30,21,16,"D",3,5,9,4,3,-25,30,12,null,2,"J","C",3,1,9,9,2,"J","B",0,-13,5,3,-12,14,10,2,"J","E",0,-4,6,3,-16,20,11]
[12," SCOTT KINNEAR","C","K",3,4,9,4,"M",3,8,12,6,6,12,21,2,"O",0,-1,6,9,6,11,27,6,"I",0,-3,8,10,6,8,35,9,null,2,"C","J",0,-1,6,10,2,"C","M",0,-5,5,0,-6,11,11,2,"C","A",0,-4,7,0,-10,18,12]
[13," NOEL WILSON","D","L",0,-5,6,14,"N",0,-9,5,12,0,-14,11,14,"P",0,-5,6,12,0,-19,17,15,"J",0,-5,6,12,0,-24,23,15,null,3,"D","K",3,14,8,13,3,"D","L",0,-5,6,3,9,14,14,3,"D","O",3,7,8,6,16,22,13,"DIVISION 3"]
[14," SHANE SPANN","L","D",3,5,9,3,"B",0,-5,6,9,3,0,15,9,"H",0,-21,5,16,3,-21,20,13,"F",0,-5,6,12,3,-26,26,13,null,3,"L","O",3,3,9,14,3,"L","D",3,5,9,6,8,18,13,3,"L","K",0,-18,5,6,-10,23,14]
[15," MICK WALSH","O","G",0,-4,7,11,"E",0,-13,5,15,0,-17,12,16,"C",3,1,9,8,3,-16,21,12,"A",0,-19,5,16,3,-35,26,14,null,3,"O","L",0,-3,6,15,3,"O","K",3,10,9,3,7,15,15,3,"O","D",0,-7,7,3,0,22,15]
[16," TONY WHITEHORN","K","C",0,-4,6,12,"A",0,-10,6,13,0,-14,12,13,"G",0,-3,6,10,0,-17,18,14,"E",0,-8,5,14,0,-25,23,16,null,3,"K","D",0,-14,7,16,3,"K","O",0,-10,6,0,-24,13,16,3,"K","L",3,18,10,3,-6,23,16]
[null,null,null,"SATURDAY - 4 rounds random opponents.  Cumulative scores.  Rankings after 4 rounds determine Sunday divisions.",null,null,null,null,null,null,null,null,null,null,null,null,null,null,null,null,null,null,null,null,null,null,null,null,null,null,null,null,null,null,null,null,null,null,"SUNDAY - After Saturday 4 rounds ranking:"]
[null,null,null,null,null,null,null,null,null,null,null,null,null,null,null,null,null,null,null,null,null,null,null,null,null,null,null,null,null,null,null,null,null,null,null,null,"Div 1",null,"3 Rounds - Pre-set draw - opponents from same division"]
[null,null,null,null,null,null,null,null,null,null,null,null,null,null,null,null,null,null,null,null,null,null,null,null,null,null,null,null,null,null,null,null,null,null,null,null,"Div 2"]
[null,null,null,null,null,null,null,null,null,null,null,null,null,null,null,null,null,null,null,null,null,null,null,null,null,null,null,null,null,null,null,null,null,null,null,null,"Div 3"]

{"sheet":"Card Sample","index":7,"n_rows":2,"n_cols":4,"rows_kept":2,"cut":false,"hidden":false,"merged":[[0,3,0,9],[1,3,3,9]]}
[null,null,null,"MACKAY BOWLING CLUB INC"]
[null,null,null,{"$f":"Main!AH19","v":"TOURNAMENT NAME"}]

{"sheet":"Draw","index":8,"n_rows":19,"n_cols":50,"rows_kept":19,"cut":false,"hidden":false,"merged":[[1,47,1,49],[0,43,0,49],[0,6,1,41],[0,0,0,4],[3,36,3,41],[1,1,1,4],[3,6,3,8],[3,14,3,16],[3,18,3,20],[3,22,3,27],[3,29,3,34],[3,10,3,12]]}
["SATURDAY",null,null,null,null,null,"Print this page after ROUND 4 results are entered.  Use printed sheet to complete details on DAY 2 cards.  I.e. Team Letters & Skips etc.",null,null,null,null,null,null,null,null,null,null,null,null,null,null,null,null,null,null,null,null,null,null,null,null,null,null,null,null,null,null,null,null,null,null,null,null,"DAY 2 Division summary"]
[null,"RINK",null,null,null,null,null,null,null,null,null,null,null,null,null,null,null,null,null,null,null,null,null,null,null,null,null,null,null,null,null,null,null,null,null,null,null,null,null,null,null,null,null,null,null,null,null,"Versus"]
["TEAM","Round 1","Round 2","Round 3","Round 4",null,null,null,null,null,null,null,null,null,null,null,null,null,null,null,null,null,"SUNDAY",null,"R5",null,null,null,null,"SUNDAY",null,"R6",null,null,null,null,"SUNDAY",null,"R7",null,null,null,null,null,"RANK","TEAM",null,"R5","R6","R7"]
["A",1,5,7,3,null,"ROUND 1",null,null,null,"ROUND 2",null,null,null,"ROUND 3",null,null,null,"ROUND 4",null,null,null,"ROUND 5",null,null,null,null,null,null,"ROUND 6",null,null,null,null,null,null,"ROUND 7",null,null,null,null,null,null,"DIV 1",1,{"$f":"Z9","v":""},null,{"$f":"AB9","v":""},{"$f":"AI11","v":""},{"$f":"AP7","v":""}]
["B",2,8,4,6,null,"Rink","T1","T2",null,"Rink","T1","T2",null,"Rink","T1","T2",null,"Rink","T1","T2",null,"RINK",null,null,null,null,null,null,"RINK",null,null,null,null,null,null,"RINK",null,null,null,null,null,null,"DIV 1",2,{"$f":"Z7","v":""},null,{"$f":"AB7","v":""},{"$f":"AG11","v":""},{"$f":"AP9","v":""}]
["C",3,7,5,1,null,1,"A","J",null,1,"E","N",null,1,"G","L",null,1,"C","P",null,1,"DIV 3","1 v 2",{"$f":"IF(Main!$AA$3=\"\",\"\",'Progress R1-R4'!C15)","v":""},"v",{"$f":"IF(Main!$AA$3=\"\",\"\",'Progress R1-R4'!C16)","v":""},null,1,"DIV 2","5 v 6",{"$f":"IF(Main!$AA$3=\"\",\"\",'Progress R1-R4'!C13)","v":""},"v",{"$f":"IF(Main!$AA$3=\"\",\"\",'Progress R1-R4'!C14)","v":""},null,1,"DIV 3","2 v 3",{"$f":"IF(Main!$AA$3=\"\",\"\",'Progress R1-R4'!C16)","v":""},"v",{"$f":"IF(Main!$AA$3=\"\",\"\",'Progress R1-R4'!C17)","v":""},null,"DIV 1",3,{"$f":"Z11","v":""},null,{"$f":"AB11","v":""},{"$f":"AI12","v":""},{"$f":"AN9","v":""}]
["D",4,6,2,8,null,2,"B","I",null,2,"F","M",null,2,"D","O",null,2,"H","K",null,2,"DIV 1","2 v 5",{"$f":"IF(Main!$AA$3=\"\",\"\",'Progress R1-R4'!C4)","v":""},"v",{"$f":"IF(Main!$AA$3=\"\",\"\",'Progress R1-R4'!C7)","v":""},null,2,"DIV 3","2 v 4",{"$f":"IF(Main!$AA$3=\"\",\"\",'Progress R1-R4'!C16)","v":""},"v",{"$f":"IF(Main!$AA$3=\"\",\"\",'Progress R1-R4'!C18)","v":""},null,2,"DIV 1","1 v 6",{"$f":"IF(Main!$AA$3=\"\",\"\",'Progress R1-R4'!C3)","v":""},"v",{"$f":"IF(Main!$AA$3=\"\",\"\",'Progress R1-R4'!C8)","v":""},null,"DIV 1",4,{"$f":"AB9","v":""},null,{"$f":"Z9","v":""},{"$f":"AG12","v":""},{"$f":"AP11","v":""}]
["E",5,1,3,7,null,3,"C","L",null,3,"G","P",null,3,"E","J",null,3,"A","N",null,3,"DIV 2","2 v 5",{"$f":"IF(Main!$AA$3=\"\",\"\",'Progress R1-R4'!C10)","v":""},"v",{"$f":"IF(Main!$AA$3=\"\",\"\",'Progress R1-R4'!C13)","v":""},null,3,"DIV 3","1 v 3",{"$f":"IF(Main!$AA$3=\"\",\"\",'Progress R1-R4'!C15)","v":""},"v",{"$f":"IF(Main!$AA$3=\"\",\"\",'Progress R1-R4'!C17)","v":""},null,3,"DIV 2","1 v 6",{"$f":"IF(Main!$AA$3=\"\",\"\",'Progress R1-R4'!C9)","v":""},"v",{"$f":"IF(Main!$AA$3=\"\",\"\",'Progress R1-R4'!C14)","v":""},null,"DIV 1",5,{"$f":"AB7","v":""},null,{"$f":"Z7","v":""},{"$f":"AI9","v":""},{"$f":"AN11","v":""}]
["F",8,2,6,4,null,4,"D","K",null,4,"H","O",null,4,"B","M",null,4,"F","I",null,4,"DIV 1","1 v 4",{"$f":"IF(Main!$AA$3=\"\",\"\",'Progress R1-R4'!C3)","v":""},"v",{"$f":"IF(Main!$AA$3=\"\",\"\",'Progress R1-R4'!C6)","v":""},null,4,"DIV 1","5 v 6",{"$f":"IF(Main!$AA$3=\"\",\"\",'Progress R1-R4'!C7)","v":""},"v",{"$f":"IF(Main!$AA$3=\"\",\"\",'Progress R1-R4'!C8)","v":""},null,4,"DIV 1","2 v 3",{"$f":"IF(Main!$AA$3=\"\",\"\",'Progress R1-R4'!C4)","v":""},"v",{"$f":"IF(Main!$AA$3=\"\",\"\",'Progress R1-R4'!C5)","v":""},null,"DIV 1",6,{"$f":"AB11","v":""},null,{"$f":"Z11","v":""},{"$f":"AG9","v":""},{"$f":"AN7","v":""}]
["G",7,3,1,5,null,5,"E","P",null,5,"A","L",null,5,"C","N",null,5,"G","J",null,5,"DIV 2","3 v 6",{"$f":"IF(Main!$AA$3=\"\",\"\",'Progress R1-R4'!C11)","v":""},"v",{"$f":"IF(Main!$AA$3=\"\",\"\",'Progress R1-R4'!C14)","v":""},null,5,"DIV 2","1 v 2",{"$f":"IF(Main!$AA$3=\"\",\"\",'Progress R1-R4'!C9)","v":""},"v",{"$f":"IF(Main!$AA$3=\"\",\"\",'Progress R1-R4'!C10)","v":""},null,5,"DIV 2","4 v 5",{"$f":"IF(Main!$AA$3=\"\",\"\",'Progress R1-R4'!C12)","v":""},"v",{"$f":"IF(Main!$AA$3=\"\",\"\",'Progress R1-R4'!C13)","v":""},null,"DIV 2",1,{"$f":"Z12","v":""},null,{"$f":"AB12","v":""},{"$f":"AI10","v":""},{"$f":"AP8","v":""}]
["H",6,4,8,2,null,6,"H","M",null,6,"D","I",null,6,"F","K",null,6,"B","O",null,6,"DIV 1","3 v 6",{"$f":"IF(Main!$AA$3=\"\",\"\",'Progress R1-R4'!C5)","v":""},"v",{"$f":"IF(Main!$AA$3=\"\",\"\",'Progress R1-R4'!C8)","v":""},null,6,"DIV 1","1 v 2",{"$f":"IF(Main!$AA$3=\"\",\"\",'Progress R1-R4'!C3)","v":""},"v",{"$f":"IF(Main!$AA$3=\"\",\"\",'Progress R1-R4'!C4)","v":""},null,6,"DIV 1","4 v 5",{"$f":"IF(Main!$AA$3=\"\",\"\",'Progress R1-R4'!C6)","v":""},"v",{"$f":"IF(Main!$AA$3=\"\",\"\",'Progress R1-R4'!C7)","v":""},null,"DIV 2",2,{"$f":"Z8","v":""},null,{"$f":"AB8","v":""},{"$f":"AG10","v":""},{"$f":"AP12","v":""}]
["I",2,6,8,4,null,7,"G","N",null,7,"C","J",null,7,"A","P",null,7,"E","L",null,7,"DIV 2","1 v 4",{"$f":"IF(Main!$AA$3=\"\",\"\",'Progress R1-R4'!C9)","v":""},"v",{"$f":"IF(Main!$AA$3=\"\",\"\",'Progress R1-R4'!C12)","v":""},null,7,"DIV 1","3 v 4",{"$f":"IF(Main!$AA$3=\"\",\"\",'Progress R1-R4'!C5)","v":""},"v",{"$f":"IF(Main!$AA$3=\"\",\"\",'Progress R1-R4'!C6)","v":""},null,7,"DIV 2","2 v 3",{"$f":"IF(Main!$AA$3=\"\",\"\",'Progress R1-R4'!C10)","v":""},"v",{"$f":"IF(Main!$AA$3=\"\",\"\",'Progress R1-R4'!C11)","v":""},null,"DIV 2",3,{"$f":"Z10","v":""},null,{"$f":"AB10","v":""},{"$f":"AI13","v":""},{"$f":"AN12","v":""}]
["J",1,7,3,5,null,8,"F","O",null,8,"B","K",null,8,"H","I",null,8,"D","M",null,8,"DIV 3","3 v 4",{"$f":"IF(Main!$AA$3=\"\",\"\",'Progress R1-R4'!C17)","v":""},"v",{"$f":"IF(Main!$AA$3=\"\",\"\",'Progress R1-R4'!C18)","v":""},null,8,"DIV 2","3 v 4",{"$f":"IF(Main!$AA$3=\"\",\"\",'Progress R1-R4'!C11)","v":""},"v",{"$f":"IF(Main!$AA$3=\"\",\"\",'Progress R1-R4'!C12)","v":""},null,8,"DIV 3","1 v 4",{"$f":"IF(Main!$AA$3=\"\",\"\",'Progress R1-R4'!C15)","v":""},"v",{"$f":"IF(Main!$AA$3=\"\",\"\",'Progress R1-R4'!C18)","v":""},null,"DIV 2",4,{"$f":"AB12","v":""},null,{"$f":"Z12","v":""},{"$f":"AG13","v":""},{"$f":"AP10","v":""}]
["K",4,8,6,2,null,null,null,null,null,null,null,null,null,null,null,null,null,null,null,null,null,null,null,"Team Letters ONLY shown after ROUND 4 completed",null,null,null,null,null,null,null,null,null,null,null,null,null,null,null,null,null,null,"DIV 2",5,{"$f":"AB8","v":""},null,{"$f":"Z8","v":""},{"$f":"AI6","v":""},{"$f":"AN10","v":""}]
["L",3,5,1,7,null,"4 Round Draw with 16 teams (preset)",null,null,null,null,null,null,null,null,null,null,null,null,null,null,null,"Div 1",null,"Div 1  - 3 Rounds preset draw in no particular order",null,null,null,null,null,null,null,null,null,null,null,null,null,null,null,null,null,null,"DIV 2",6,{"$f":"AB10","v":""},null,{"$f":"Z10","v":""},{"$f":"AG6","v":""},{"$f":"AN8","v":""}]
["M",6,2,4,8,null,"Each team - 1 game only on outside rink",null,null,null,null,null,null,null,null,null,null,null,null,null,null,null,"Div 2",null,"Div 2 - 3 Rounds preset draw in no particular order",null,null,null,null,null,null,null,null,null,null,null,null,null,null,null,null,null,null,"DIV 3",1,{"$f":"Z6","v":""},null,{"$f":"AB6","v":""},{"$f":"AI8","v":""},{"$f":"AP13","v":""}]
["N",7,1,5,3,null,"Different opponent each round",null,null,null,null,null,null,null,null,null,null,null,null,null,null,null,"Div 3",null,"Div 3 - Round robin",null,null,null,null,null,null,null,null,null,null,null,null,null,null,null,null,null,null,"DIV 3",2,{"$f":"AB6","v":""},null,{"$f":"Z6","v":""},{"$f":"AI7","v":""},{"$f":"AP6","v":""}]
["O",8,4,2,6,null,null,null,null,null,null,null,null,null,null,null,null,null,null,null,null,null,null,null,"Skips blind draw from card sets at start of day 2",null,null,null,null,null,null,null,null,null,null,null,null,null,null,null,null,null,null,"DIV 3",3,{"$f":"Z13","v":""},null,{"$f":"AB13","v":""},{"$f":"AG8","v":""},{"$f":"AN6","v":""}]
["P",5,3,7,1,null,null,null,null,null,null,null,null,null,null,null,null,null,null,null,null,null,null,null,null,null,null,null,null,null,null,null,null,null,null,null,null,null,null,null,null,null,null,"DIV 3",4,{"$f":"AB13","v":""},null,{"$f":"Z13","v":""},{"$f":"AG7","v":""},{"$f":"AN13","v":""}]

{"sheet":"Data R1-R4","index":9,"n_rows":37,"n_cols":52,"rows_kept":37,"cut":false,"hidden":false,"merged":[]}
["TEAM","Lead, Second, Third","SKIP","POINTS","Margin","Ends",null,"R1 v team","Points","Margin","Ends ","R2 v team","Points","Margin","Ends ","R3 v team","Points","Margin","Ends ","R4 v team","Points","Margin","Ends ",null,null,null,null,null,null,"Rink","T1","Score","Ends",null,"T2","Score","Ends"]
[{"$f":"Main!AG2","v":"A"},{"$f":"Main!AI2","v":"Eddie Roberts, Steve Lane, Mick Pilcher"},{"$f":"Main!AH2","v":"GREG THOMSEN"},{"$f":"((COUNTIFS($AE$3:$AE$10,A2,$AH$3:$AH$10,\"W\")+COUNTIFS($AI$3:$AI$10,A2,$AL$3:$AL$10,\"W\")+COUNTIFS($AE$12:$AE$19,A2,$AH$12:$AH$19,\"W\")+COUNTIFS($AI$12:$AI$19,A2,$AL$12:$AL$19,\"W\")+COUNTIFS($AE$21:$AE$28,A2,$AH$21:$AH$28,\"W\")+COUNTIFS($AI$21:$AI$28,A2,$AL$21:$AL$28,\"W\")+COUNTIFS($AE$30:$AE$37,A2,$AH$30:$AH$37,\"W\")+COUNTIFS($AI$30:$AI$37,A2,$AL$30:$AL$37,\"W\"))*3)+((COUNTIFS($AE$3:$AE$10,A2,$AH$3:$AH$10,\"L\")+COUNTIFS($AI$3:$AI$10,A2,$AL$3:$AL$10,\"L\")+COUNTIFS($AE$12:$AE$19,A2,$AH$12:$AH$19,\"L\")+COUNTIFS($AI$12:$AI$19,A2,$AL$12:$AL$19,\"L\")+COUNTIFS($AE$21:$AE$28,A2,$AH$21:$AH$28,\"L\")+COUNTIFS($AI$21:$AI$28,A2,$AL$21:$AL$28,\"L\")+COUNTIFS($AE$30:$AE$37,A2,$AH$30:$AH$37,\"L\")+COUNTIFS($AI$30:$AI$37,A2,$AL$30:$AL$37,\"L\"))*0)+((COUNTIFS($AE$3:$AE$10,A2,$AH$3:$AH$10,\"D\")+COUNTIFS($AI$3:$AI$10,A2,$AL$3:$AL$10,\"D\")+COUNTIFS($AE$12:$AE$19,A2,$AH$12:$AH$19,\"D\")+COUNTIFS($AI$12:$AI$19,A2,$AL$12:$AL$19,\"D\")+COUNTIFS($AE$21:$AE$28,A2,$AH$21:$AH$28,\"D\")+COUNTIFS($AI$21:$AI$28,A2,$AL$21:$AL$28,\"D\")+COUNTIFS($AE$30:$AE$37,A2,$AH$30:$AH$37,\"D\")+COUNTIFS($AI$30:$AI$37,A2,$AL$30:$AL$37,\"D\")))-Main!$Q$28","v":0},{"$f":"SUMIF($AE$3:$AE$10,A2,$AF$3:$AF$10)-SUMIF($AE$3:$AE$10,A2,$AJ$3:$AJ$10)+SUMIF($AI$3:$AI$10,A2,$AJ$3:$AJ$10)-SUMIF($AI$3:$AI$10,A2,$AF$3:$AF$10)+SUMIF($AE$12:$AE$19,A2,$AF$12:$AF$19)-SUMIF($AE$12:$AE$19,A2,$AJ$12:$AJ$19)+SUMIF($AI$12:$AI$19,A2,$AJ$12:$AJ$19)-SUMIF($AI$12:$AI$19,A2,$AF$12:$AF$19)+SUMIF($AE$21:$AE$28,A2,$AF$21:$AF$28)-SUMIF($AE$21:$AE$28,A2,$AJ$21:$AJ$28)+SUMIF($AI$21:$AI$28,A2,$AJ$21:$AJ$28)-SUMIF($AI$21:$AI$28,A2,$AF$21:$AF$28)+SUMIF($AE$30:$AE$37,A2,$AF$30:$AF$37)-SUMIF($AE$30:$AE$37,A2,$AJ$30:$AJ$37)+SUMIF($AI$30:$AI$37,A2,$AJ$30:$AJ$37)-SUMIF($AI$30:$AI$37,A2,$AF$30:$AF$37)","v":0},{"$f":"SUMIF($AE$3:$AE$10,A2,$AG$3:$AG$10)+SUMIF($AI$3:$AI$10,A2,$AK$3:$AK$10)+SUMIF($AE$12:$AE$19,A2,$AG$12:$AG$19)+SUMIF($AI$12:$AI$19,A2,$AK$12:$AK$19)+SUMIF($AE$21:$AE$28,A2,$AG$21:$AG$28)+SUMIF($AI$21:$AI$28,A2,$AK$21:$AK$28)+SUMIF($AE$30:$AE$37,A2,$AG$30:$AG$37)+SUMIF($AI$30:$AI$37,A2,$AK$30:$AK$37)","v":0},null,{"$f":"IFERROR(VLOOKUP(A2,$AN$3:$AO$10,2,0),\"\") & IFERROR(VLOOKUP(A2,$AO$3:$AP$10,2,0),\"\")","v":"I"},{"$f":"(((COUNTIFS($AE$3:$AE$10,A2,$AH$3:$AH$10,\"W\")+COUNTIFS($AI$3:$AI$10,A2,$AL$3:$AL$10,\"W\")))*3)+((COUNTIFS($AE$3:$AE$10,A2,$AH$3:$AH$10,\"D\")+COUNTIFS($AI$3:$AI$10,A2,$AL$3:$AL$10,\"D\")))","v":1},{"$f":"SUMIF($AE$3:$AE$10,A2,$AF$3:$AF$10)-SUMIF($AE$3:$AE$10,A2,$AJ$3:$AJ$10)","v":0},{"$f":"SUMIF($AE$3:$AE$10,A2,$AG$3:$AG$10)+SUMIF($AI$3:$AI$10,A2,$AK$3:$AK$10)","v":0},{"$f":"IFERROR(VLOOKUP(A2,$AN$12:$AO$19,2,0),\"\") & IFERROR(VLOOKUP(A2,$AO$12:$AP$19,2,0),\"\")","v":"K"},{"$f":"(((COUNTIFS($AE$12:$AE$19,A2,$AH$12:$AH$19,\"W\")+COUNTIFS($AI$12:$AI$19,A2,$AL$12:$AL$19,\"W\")))*3)+((COUNTIFS($AE$12:$AE$19,A2,$AH$12:$AH$19,\"D\")+COUNTIFS($AI$12:$AI$19,A2,$AL$12:$AL$19,\"D\")))","v":1},{"$f":"SUMIF($AE$12:$AE$19,A2,$AF$12:$AF$19)-SUMIF($AE$12:$AE$19,A2,$AJ$12:$AJ$19)","v":0},{"$f":"SUMIF($AE$12:$AE$19,A2,$AG$12:$AG$19)+SUMIF($AI$12:$AI$19,A2,$AK$12:$AK$19)","v":0},{"$f":"IFERROR(VLOOKUP(A2,$AN$21:$AO$28,2,0),\"\") & IFERROR(VLOOKUP(A2,$AO$21:$AP$28,2,0),\"\")","v":"M"},{"$f":"(((COUNTIFS($AE$21:$AE$28,A2,$AH$21:$AH$28,\"W\")+COUNTIFS($AI$21:$AI$28,A2,$AL$21:$AL$28,\"W\")))*3)+((COUNTIFS($AE$21:$AE$28,A2,$AH$21:$AH$28,\"D\")+COUNTIFS($AI$21:$AI$28,A2,$AL$21:$AL$28,\"D\")))","v":1},{"$f":"SUMIF($AE$21:$AE$28,A2,$AF$21:$AF$28)-SUMIF($AE$21:$AE$28,A2,$AJ$21:$AJ$28)","v":0},{"$f":"SUMIF($AE$21:$AE$28,A2,$AG$21:$AG$28)+SUMIF($AI$21:$AI$28,A2,$AK$21:$AK$28)","v":0},{"$f":"IFERROR(VLOOKUP(A2,$AN$30:$AO$37,2,0),\"\") & IFERROR(VLOOKUP(A2,$AO$30:$AP$37,2,0),\"\")","v":"O"},{"$f":"(((COUNTIFS($AE$30:$AE$37,A2,$AH$30:$AH$37,\"W\")+COUNTIFS($AI$30:$AI$37,A2,$AL$30:$AL$37,\"W\")))*3)+((COUNTIFS($AE$30:$AE$37,A2,$AH$30:$AH$37,\"D\")+COUNTIFS($AI$30:$AI$37,A2,$AL$30:$AL$37,\"D\")))","v":1},{"$f":"SUMIF($AE$30:$AE$37,A2,$AF$30:$AF$37)-SUMIF($AE$30:$AE$37,A2,$AJ$30:$AJ$37)","v":0},{"$f":"SUMIF($AE$30:$AE$37,A2,$AG$30:$AG$37)+SUMIF($AI$30:$AI$37,A2,$AK$30:$AK$37)","v":0},null,null,null,null,null,null,"ROUND 1",null,null,null,null,null,null,null,null,null,null,null,null,null,{"$f":"((COUNTIFS($AE$3:$AE$10,A2,$AH$3:$AH$10,\"W\")+COUNTIFS($AI$3:$AI$10,A2,$AL$3:$AL$10,\"W\")+COUNTIFS($AE$12:$AE$19,A2,$AH$12:$AH$19,\"W\")+COUNTIFS($AI$12:$AI$19,A2,$AL$12:$AL$19,\"W\")+COUNTIFS($AE$21:$AE$28,A2,$AH$21:$AH$28,\"W\")+COUNTIFS($AI$21:$AI$28,A2,$AL$21:$AL$28,\"W\")+COUNTIFS($AE$30:$AE$37,A2,$AH$30:$AH$37,\"W\")+COUNTIFS($AI$30:$AI$37,A2,$AL$30:$AL$37,\"W\"))*3)","v":0},{"$f":"((COUNTIFS($AE$3:$AE$10,A2,$AH$3:$AH$10,\"L\")+COUNTIFS($AI$3:$AI$10,A2,$AL$3:$AL$10,\"L\")+COUNTIFS($AE$12:$AE$19,A2,$AH$12:$AH$19,\"L\")+COUNTIFS($AI$12:$AI$19,A2,$AL$12:$AL$19,\"L\")+COUNTIFS($AE$21:$AE$28,A2,$AH$21:$AH$28,\"L\")+COUNTIFS($AI$21:$AI$28,A2,$AL$21:$AL$28,\"L\")+COUNTIFS($AE$30:$AE$37,A2,$AH$30:$AH$37,\"L\")+COUNTIFS($AI$30:$AI$37,A2,$AL$30:$AL$37,\"L\"))*0)","v":0},{"$f":"((COUNTIFS($AE$3:$AE$10,A2,$AH$3:$AH$10,\"D\")+COUNTIFS($AI$3:$AI$10,A2,$AL$3:$AL$10,\"D\")+COUNTIFS($AE$12:$AE$19,A2,$AH$12:$AH$19,\"D\")+COUNTIFS($AI$12:$AI$19,A2,$AL$12:$AL$19,\"D\")+COUNTIFS($AE$21:$AE$28,A2,$AH$21:$AH$28,\"D\")+COUNTIFS($AI$21:$AI$28,A2,$AL$21:$AL$28,\"D\")+COUNTIFS($AE$30:$AE$37,A2,$AH$30:$AH$37,\"D\")+COUNTIFS($AI$30:$AI$37,A2,$AL$30:$AL$37,\"D\")))","v":4},null,null,{"$f":"H2&L2&P2&T2&X2","v":"IKMO"},{"$f":"removedupes1(AW2)","v":"IKMO"},{"$f":"LEN(AW2)","v":4},"A"]
[{"$f":"Main!AG3","v":"B"},{"$f":"Main!AI3","v":"Sam Campion, A Matson, C Leeson"},{"$f":"Main!AH3","v":"DENNIS MADDEN"},{"$f":"((COUNTIFS($AE$3:$AE$10,A3,$AH$3:$AH$10,\"W\")+COUNTIFS($AI$3:$AI$10,A3,$AL$3:$AL$10,\"W\")+COUNTIFS($AE$12:$AE$19,A3,$AH$12:$AH$19,\"W\")+COUNTIFS($AI$12:$AI$19,A3,$AL$12:$AL$19,\"W\")+COUNTIFS($AE$21:$AE$28,A3,$AH$21:$AH$28,\"W\")+COUNTIFS($AI$21:$AI$28,A3,$AL$21:$AL$28,\"W\")+COUNTIFS($AE$30:$AE$37,A3,$AH$30:$AH$37,\"W\")+COUNTIFS($AI$30:$AI$37,A3,$AL$30:$AL$37,\"W\"))*3)+((COUNTIFS($AE$3:$AE$10,A3,$AH$3:$AH$10,\"L\")+COUNTIFS($AI$3:$AI$10,A3,$AL$3:$AL$10,\"L\")+COUNTIFS($AE$12:$AE$19,A3,$AH$12:$AH$19,\"L\")+COUNTIFS($AI$12:$AI$19,A3,$AL$12:$AL$19,\"L\")+COUNTIFS($AE$21:$AE$28,A3,$AH$21:$AH$28,\"L\")+COUNTIFS($AI$21:$AI$28,A3,$AL$21:$AL$28,\"L\")+COUNTIFS($AE$30:$AE$37,A3,$AH$30:$AH$37,\"L\")+COUNTIFS($AI$30:$AI$37,A3,$AL$30:$AL$37,\"L\"))*0)+((COUNTIFS($AE$3:$AE$10,A3,$AH$3:$AH$10,\"D\")+COUNTIFS($AI$3:$AI$10,A3,$AL$3:$AL$10,\"D\")+COUNTIFS($AE$12:$AE$19,A3,$AH$12:$AH$19,\"D\")+COUNTIFS($AI$12:$AI$19,A3,$AL$12:$AL$19,\"D\")+COUNTIFS($AE$21:$AE$28,A3,$AH$21:$AH$28,\"D\")+COUNTIFS($AI$21:$AI$28,A3,$AL$21:$AL$28,\"D\")+COUNTIFS($AE$30:$AE$37,A3,$AH$30:$AH$37,\"D\")+COUNTIFS($AI$30:$AI$37,A3,$AL$30:$AL$37,\"D\")))-Main!$Q$28","v":0},0,0,null,{"$f":"IFERROR(VLOOKUP(A3,$AN$3:$AO$10,2,0),\"\") & IFERROR(VLOOKUP(A3,$AO$3:$AP$10,2,0),\"\")","v":"J"},{"$f":"(((COUNTIFS($AE$3:$AE$10,A3,$AH$3:$AH$10,\"W\")+COUNTIFS($AI$3:$AI$10,A3,$AL$3:$AL$10,\"W\")))*3)+((COUNTIFS($AE$3:$AE$10,A3,$AH$3:$AH$10,\"D\")+COUNTIFS($AI$3:$AI$10,A3,$AL$3:$AL$10,\"D\")))","v":1},{"$f":"SUMIF($AE$3:$AE$10,A3,$AF$3:$AF$10)-SUMIF($AE$3:$AE$10,A3,$AJ$3:$AJ$10)","v":0},{"$f":"SUMIF($AE$3:$AE$10,A3,$AG$3:$AG$10)+SUMIF($AI$3:$AI$10,A3,$AK$3:$AK$10)","v":0},{"$f":"IFERROR(VLOOKUP(A3,$AN$12:$AO$19,2,0),\"\") & IFERROR(VLOOKUP(A3,$AO$12:$AP$19,2,0),\"\")","v":"L"},1,{"$f":"SUMIF($AE$12:$AE$19,A3,$AF$12:$AF$19)-SUMIF($AE$12:$AE$19,A3,$AJ$12:$AJ$19)","v":0},{"$f":"SUMIF($AE$12:$AE$19,A3,$AG$12:$AG$19)+SUMIF($AI$12:$AI$19,A3,$AK$12:$AK$19)","v":0},{"$f":"IFERROR(VLOOKUP(A3,$AN$21:$AO$28,2,0),\"\") & IFERROR(VLOOKUP(A3,$AO$21:$AP$28,2,0),\"\")","v":"N"},1,{"$f":"SUMIF($AE$21:$AE$28,A3,$AF$21:$AF$28)-SUMIF($AE$21:$AE$28,A3,$AJ$21:$AJ$28)","v":0},{"$f":"SUMIF($AE$21:$AE$28,A3,$AG$21:$AG$28)+SUMIF($AI$21:$AI$28,A3,$AK$21:$AK$28)","v":0},{"$f":"IFERROR(VLOOKUP(A3,$AN$30:$AO$37,2,0),\"\") & IFERROR(VLOOKUP(A3,$AO$30:$AP$37,2,0),\"\")","v":"P"},1,{"$f":"SUMIF($AE$30:$AE$37,A3,$AF$30:$AF$37)-SUMIF($AE$30:$AE$37,A3,$AJ$30:$AJ$37)","v":0},{"$f":"SUMIF($AE$30:$AE$37,A3,$AG$30:$AG$37)+SUMIF($AI$30:$AI$37,A3,$AK$30:$AK$37)","v":0},null,null,null,null,null,null,1,{"$f":"Main!B3","v":"A"},{"$f":"Main!C3","v":0},{"$f":"Main!D3","v":0},{"$f":"IF(AF3>AJ3,\"W\",IF(AF3<AJ3,\"L\",\"D\"))","v":"D"},{"$f":"Main!E3","v":"I"},{"$f":"Main!F3","v":0},{"$f":"Main!G3","v":0},{"$f":"IF(AJ3>AF3,\"W\",IF(AJ3<AF3,\"L\",\"D\"))","v":"D"},null,{"$f":"AE3","v":"A"},{"$f":"AI3","v":"I"},{"$f":"AE3","v":"A"},null,0,0,4,null,null,"JLNP",{"$f":"removedupes1(AW3)","v":"JLNP"},{"$f":"LEN(AW3)","v":4},"B"]
[{"$f":"Main!AG4","v":"C"},{"$f":"Main!AI4","v":"David Cleary, Doug Wootton, Luke Kinnear"},{"$f":"Main!AH4","v":"SCOTT KINNEAR"},{"$f":"((COUNTIFS($AE$3:$AE$10,A4,$AH$3:$AH$10,\"W\")+COUNTIFS($AI$3:$AI$10,A4,$AL$3:$AL$10,\"W\")+COUNTIFS($AE$12:$AE$19,A4,$AH$12:$AH$19,\"W\")+COUNTIFS($AI$12:$AI$19,A4,$AL$12:$AL$19,\"W\")+COUNTIFS($AE$21:$AE$28,A4,$AH$21:$AH$28,\"W\")+COUNTIFS($AI$21:$AI$28,A4,$AL$21:$AL$28,\"W\")+COUNTIFS($AE$30:$AE$37,A4,$AH$30:$AH$37,\"W\")+COUNTIFS($AI$30:$AI$37,A4,$AL$30:$AL$37,\"W\"))*3)+((COUNTIFS($AE$3:$AE$10,A4,$AH$3:$AH$10,\"L\")+COUNTIFS($AI$3:$AI$10,A4,$AL$3:$AL$10,\"L\")+COUNTIFS($AE$12:$AE$19,A4,$AH$12:$AH$19,\"L\")+COUNTIFS($AI$12:$AI$19,A4,$AL$12:$AL$19,\"L\")+COUNTIFS($AE$21:$AE$28,A4,$AH$21:$AH$28,\"L\")+COUNTIFS($AI$21:$AI$28,A4,$AL$21:$AL$28,\"L\")+COUNTIFS($AE$30:$AE$37,A4,$AH$30:$AH$37,\"L\")+COUNTIFS($AI$30:$AI$37,A4,$AL$30:$AL$37,\"L\"))*0)+((COUNTIFS($AE$3:$AE$10,A4,$AH$3:$AH$10,\"D\")+COUNTIFS($AI$3:$AI$10,A4,$AL$3:$AL$10,\"D\")+COUNTIFS($AE$12:$AE$19,A4,$AH$12:$AH$19,\"D\")+COUNTIFS($AI$12:$AI$19,A4,$AL$12:$AL$19,\"D\")+COUNTIFS($AE$21:$AE$28,A4,$AH$21:$AH$28,\"D\")+COUNTIFS($AI$21:$AI$28,A4,$AL$21:$AL$28,\"D\")+COUNTIFS($AE$30:$AE$37,A4,$AH$30:$AH$37,\"D\")+COUNTIFS($AI$30:$AI$37,A4,$AL$30:$AL$37,\"D\")))-Main!$Q$28","v":0},0,0,null,"K",1,0,0,"M",1,0,0,"O",1,0,0,"I",1,0,0,null,null,null,null,null,null,2,{"$f":"Main!B4","v":"B"},{"$f":"Main!C4","v":0},{"$f":"Main!D4","v":0},{"$f":"IF(AF4>AJ4,\"W\",IF(AF4<AJ4,\"L\",\"D\"))","v":"D"},{"$f":"Main!E4","v":"J"},{"$f":"Main!F4","v":0},{"$f":"Main!G4","v":0},{"$f":"IF(AJ4>AF4,\"W\",IF(AJ4<AF4,\"L\",\"D\"))","v":"D"},null,"B","J","B",null,0,0,4,null,null,"KMOI","KMOI",4,"C"]
[{"$f":"Main!AG5","v":"D"},{"$f":"Main!AI5","v":"Geoff Jolly, Bruce McLaughlin, Barry Paskins"},{"$f":"Main!AH5","v":"NOEL WILSON"},{"$f":"((COUNTIFS($AE$3:$AE$10,A5,$AH$3:$AH$10,\"W\")+COUNTIFS($AI$3:$AI$10,A5,$AL$3:$AL$10,\"W\")+COUNTIFS($AE$12:$AE$19,A5,$AH$12:$AH$19,\"W\")+COUNTIFS($AI$12:$AI$19,A5,$AL$12:$AL$19,\"W\")+COUNTIFS($AE$21:$AE$28,A5,$AH$21:$AH$28,\"W\")+COUNTIFS($AI$21:$AI$28,A5,$AL$21:$AL$28,\"W\")+COUNTIFS($AE$30:$AE$37,A5,$AH$30:$AH$37,\"W\")+COUNTIFS($AI$30:$AI$37,A5,$AL$30:$AL$37,\"W\"))*3)+((COUNTIFS($AE$3:$AE$10,A5,$AH$3:$AH$10,\"L\")+COUNTIFS($AI$3:$AI$10,A5,$AL$3:$AL$10,\"L\")+COUNTIFS($AE$12:$AE$19,A5,$AH$12:$AH$19,\"L\")+COUNTIFS($AI$12:$AI$19,A5,$AL$12:$AL$19,\"L\")+COUNTIFS($AE$21:$AE$28,A5,$AH$21:$AH$28,\"L\")+COUNTIFS($AI$21:$AI$28,A5,$AL$21:$AL$28,\"L\")+COUNTIFS($AE$30:$AE$37,A5,$AH$30:$AH$37,\"L\")+COUNTIFS($AI$30:$AI$37,A5,$AL$30:$AL$37,\"L\"))*0)+((COUNTIFS($AE$3:$AE$10,A5,$AH$3:$AH$10,\"D\")+COUNTIFS($AI$3:$AI$10,A5,$AL$3:$AL$10,\"D\")+COUNTIFS($AE$12:$AE$19,A5,$AH$12:$AH$19,\"D\")+COUNTIFS($AI$12:$AI$19,A5,$AL$12:$AL$19,\"D\")+COUNTIFS($AE$21:$AE$28,A5,$AH$21:$AH$28,\"D\")+COUNTIFS($AI$21:$AI$28,A5,$AL$21:$AL$28,\"D\")+COUNTIFS($AE$30:$AE$37,A5,$AH$30:$AH$37,\"D\")+COUNTIFS($AI$30:$AI$37,A5,$AL$30:$AL$37,\"D\")))-Main!$Q$28","v":0},0,0,null,"L",1,0,0,"N",1,0,0,"P",1,0,0,"J",1,0,0,null,null,null,null,null,null,3,{"$f":"Main!B5","v":"C"},{"$f":"Main!C5","v":0},{"$f":"Main!D5","v":0},"D",{"$f":"Main!E5","v":"K"},{"$f":"Main!F5","v":0},{"$f":"Main!G5","v":0},"D",null,"C","K","C",null,0,0,4,null,null,"LNPJ","LNPJ",4,"D"]
[{"$f":"Main!AG6","v":"E"},{"$f":"Main!AI6","v":"Kevin Tranberg, Barry Brown, Rickie Dunn"},{"$f":"Main!AH6","v":"GERRY BOGERT"},{"$f":"((COUNTIFS($AE$3:$AE$10,A6,$AH$3:$AH$10,\"W\")+COUNTIFS($AI$3:$AI$10,A6,$AL$3:$AL$10,\"W\")+COUNTIFS($AE$12:$AE$19,A6,$AH$12:$AH$19,\"W\")+COUNTIFS($AI$12:$AI$19,A6,$AL$12:$AL$19,\"W\")+COUNTIFS($AE$21:$AE$28,A6,$AH$21:$AH$28,\"W\")+COUNTIFS($AI$21:$AI$28,A6,$AL$21:$AL$28,\"W\")+COUNTIFS($AE$30:$AE$37,A6,$AH$30:$AH$37,\"W\")+COUNTIFS($AI$30:$AI$37,A6,$AL$30:$AL$37,\"W\"))*3)+((COUNTIFS($AE$3:$AE$10,A6,$AH$3:$AH$10,\"L\")+COUNTIFS($AI$3:$AI$10,A6,$AL$3:$AL$10,\"L\")+COUNTIFS($AE$12:$AE$19,A6,$AH$12:$AH$19,\"L\")+COUNTIFS($AI$12:$AI$19,A6,$AL$12:$AL$19,\"L\")+COUNTIFS($AE$21:$AE$28,A6,$AH$21:$AH$28,\"L\")+COUNTIFS($AI$21:$AI$28,A6,$AL$21:$AL$28,\"L\")+COUNTIFS($AE$30:$AE$37,A6,$AH$30:$AH$37,\"L\")+COUNTIFS($AI$30:$AI$37,A6,$AL$30:$AL$37,\"L\"))*0)+((COUNTIFS($AE$3:$AE$10,A6,$AH$3:$AH$10,\"D\")+COUNTIFS($AI$3:$AI$10,A6,$AL$3:$AL$10,\"D\")+COUNTIFS($AE$12:$AE$19,A6,$AH$12:$AH$19,\"D\")+COUNTIFS($AI$12:$AI$19,A6,$AL$12:$AL$19,\"D\")+COUNTIFS($AE$21:$AE$28,A6,$AH$21:$AH$28,\"D\")+COUNTIFS($AI$21:$AI$28,A6,$AL$21:$AL$28,\"D\")+COUNTIFS($AE$30:$AE$37,A6,$AH$30:$AH$37,\"D\")+COUNTIFS($AI$30:$AI$37,A6,$AL$30:$AL$37,\"D\")))-Main!$Q$28","v":0},0,0,null,"M",1,0,0,"O",1,0,0,"I",1,0,0,"K",1,0,0,null,null,null,null,null,null,4,{"$f":"Main!B6","v":"D"},{"$f":"Main!C6","v":0},{"$f":"Main!D6","v":0},"D",{"$f":"Main!E6","v":"L"},{"$f":"Main!F6","v":0},{"$f":"Main!G6","v":0},"D",null,"D","L","D",null,0,0,4,null,null,"MOIK","MOIK",4,"E"]
[{"$f":"Main!AG7","v":"F"},{"$f":"Main!AI7","v":"Dan Robinson, Jim Wallace, Adam Johnson"},{"$f":"Main!AH7","v":"NOEL BRAND"},{"$f":"((COUNTIFS($AE$3:$AE$10,A7,$AH$3:$AH$10,\"W\")+COUNTIFS($AI$3:$AI$10,A7,$AL$3:$AL$10,\"W\")+COUNTIFS($AE$12:$AE$19,A7,$AH$12:$AH$19,\"W\")+COUNTIFS($AI$12:$AI$19,A7,$AL$12:$AL$19,\"W\")+COUNTIFS($AE$21:$AE$28,A7,$AH$21:$AH$28,\"W\")+COUNTIFS($AI$21:$AI$28,A7,$AL$21:$AL$28,\"W\")+COUNTIFS($AE$30:$AE$37,A7,$AH$30:$AH$37,\"W\")+COUNTIFS($AI$30:$AI$37,A7,$AL$30:$AL$37,\"W\"))*3)+((COUNTIFS($AE$3:$AE$10,A7,$AH$3:$AH$10,\"L\")+COUNTIFS($AI$3:$AI$10,A7,$AL$3:$AL$10,\"L\")+COUNTIFS($AE$12:$AE$19,A7,$AH$12:$AH$19,\"L\")+COUNTIFS($AI$12:$AI$19,A7,$AL$12:$AL$19,\"L\")+COUNTIFS($AE$21:$AE$28,A7,$AH$21:$AH$28,\"L\")+COUNTIFS($AI$21:$AI$28,A7,$AL$21:$AL$28,\"L\")+COUNTIFS($AE$30:$AE$37,A7,$AH$30:$AH$37,\"L\")+COUNTIFS($AI$30:$AI$37,A7,$AL$30:$AL$37,\"L\"))*0)+((COUNTIFS($AE$3:$AE$10,A7,$AH$3:$AH$10,\"D\")+COUNTIFS($AI$3:$AI$10,A7,$AL$3:$AL$10,\"D\")+COUNTIFS($AE$12:$AE$19,A7,$AH$12:$AH$19,\"D\")+COUNTIFS($AI$12:$AI$19,A7,$AL$12:$AL$19,\"D\")+COUNTIFS($AE$21:$AE$28,A7,$AH$21:$AH$28,\"D\")+COUNTIFS($AI$21:$AI$28,A7,$AL$21:$AL$28,\"D\")+COUNTIFS($AE$30:$AE$37,A7,$AH$30:$AH$37,\"D\")+COUNTIFS($AI$30:$AI$37,A7,$AL$30:$AL$37,\"D\")))-Main!$Q$28","v":0},0,0,null,"N",1,0,0,"P",1,0,0,"J",1,0,0,"L",1,0,0,null,null,null,null,null,null,5,{"$f":"Main!B7","v":"E"},{"$f":"Main!C7","v":0},{"$f":"Main!D7","v":0},"D",{"$f":"Main!E7","v":"M"},{"$f":"Main!F7","v":0},{"$f":"Main!G7","v":0},"D",null,"E","M","E",null,0,0,4,null,null,"NPJL","NPJL",4,"F"]
[{"$f":"Main!AG8","v":"G"},{"$f":"Main!AI8","v":"Peter Taft, Alan Bennett, Brian Archer"},{"$f":"Main!AH8","v":"ROBBIE HARRIS"},{"$f":"((COUNTIFS($AE$3:$AE$10,A8,$AH$3:$AH$10,\"W\")+COUNTIFS($AI$3:$AI$10,A8,$AL$3:$AL$10,\"W\")+COUNTIFS($AE$12:$AE$19,A8,$AH$12:$AH$19,\"W\")+COUNTIFS($AI$12:$AI$19,A8,$AL$12:$AL$19,\"W\")+COUNTIFS($AE$21:$AE$28,A8,$AH$21:$AH$28,\"W\")+COUNTIFS($AI$21:$AI$28,A8,$AL$21:$AL$28,\"W\")+COUNTIFS($AE$30:$AE$37,A8,$AH$30:$AH$37,\"W\")+COUNTIFS($AI$30:$AI$37,A8,$AL$30:$AL$37,\"W\"))*3)+((COUNTIFS($AE$3:$AE$10,A8,$AH$3:$AH$10,\"L\")+COUNTIFS($AI$3:$AI$10,A8,$AL$3:$AL$10,\"L\")+COUNTIFS($AE$12:$AE$19,A8,$AH$12:$AH$19,\"L\")+COUNTIFS($AI$12:$AI$19,A8,$AL$12:$AL$19,\"L\")+COUNTIFS($AE$21:$AE$28,A8,$AH$21:$AH$28,\"L\")+COUNTIFS($AI$21:$AI$28,A8,$AL$21:$AL$28,\"L\")+COUNTIFS($AE$30:$AE$37,A8,$AH$30:$AH$37,\"L\")+COUNTIFS($AI$30:$AI$37,A8,$AL$30:$AL$37,\"L\"))*0)+((COUNTIFS($AE$3:$AE$10,A8,$AH$3:$AH$10,\"D\")+COUNTIFS($AI$3:$AI$10,A8,$AL$3:$AL$10,\"D\")+COUNTIFS($AE$12:$AE$19,A8,$AH$12:$AH$19,\"D\")+COUNTIFS($AI$12:$AI$19,A8,$AL$12:$AL$19,\"D\")+COUNTIFS($AE$21:$AE$28,A8,$AH$21:$AH$28,\"D\")+COUNTIFS($AI$21:$AI$28,A8,$AL$21:$AL$28,\"D\")+COUNTIFS($AE$30:$AE$37,A8,$AH$30:$AH$37,\"D\")+COUNTIFS($AI$30:$AI$37,A8,$AL$30:$AL$37,\"D\")))-Main!$Q$28","v":0},0,0,null,"O",1,0,0,"I",1,0,0,"K",1,0,0,"M",1,0,0,null,null,null,null,null,null,6,{"$f":"Main!B8","v":"F"},{"$f":"Main!C8","v":0},{"$f":"Main!D8","v":0},"D",{"$f":"Main!E8","v":"N"},{"$f":"Main!F8","v":0},{"$f":"Main!G8","v":0},"D",null,"F","N","F",null,0,0,4,null,null,"OIKM","OIKM",4,"G"]
[{"$f":"Main!AG9","v":"H"},{"$f":"Main!AI9","v":"David Peet, Don Orr, Mark Glew"},{"$f":"Main!AH9","v":"WADE CRANSTON"},{"$f":"((COUNTIFS($AE$3:$AE$10,A9,$AH$3:$AH$10,\"W\")+COUNTIFS($AI$3:$AI$10,A9,$AL$3:$AL$10,\"W\")+COUNTIFS($AE$12:$AE$19,A9,$AH$12:$AH$19,\"W\")+COUNTIFS($AI$12:$AI$19,A9,$AL$12:$AL$19,\"W\")+COUNTIFS($AE$21:$AE$28,A9,$AH$21:$AH$28,\"W\")+COUNTIFS($AI$21:$AI$28,A9,$AL$21:$AL$28,\"W\")+COUNTIFS($AE$30:$AE$37,A9,$AH$30:$AH$37,\"W\")+COUNTIFS($AI$30:$AI$37,A9,$AL$30:$AL$37,\"W\"))*3)+((COUNTIFS($AE$3:$AE$10,A9,$AH$3:$AH$10,\"L\")+COUNTIFS($AI$3:$AI$10,A9,$AL$3:$AL$10,\"L\")+COUNTIFS($AE$12:$AE$19,A9,$AH$12:$AH$19,\"L\")+COUNTIFS($AI$12:$AI$19,A9,$AL$12:$AL$19,\"L\")+COUNTIFS($AE$21:$AE$28,A9,$AH$21:$AH$28,\"L\")+COUNTIFS($AI$21:$AI$28,A9,$AL$21:$AL$28,\"L\")+COUNTIFS($AE$30:$AE$37,A9,$AH$30:$AH$37,\"L\")+COUNTIFS($AI$30:$AI$37,A9,$AL$30:$AL$37,\"L\"))*0)+((COUNTIFS($AE$3:$AE$10,A9,$AH$3:$AH$10,\"D\")+COUNTIFS($AI$3:$AI$10,A9,$AL$3:$AL$10,\"D\")+COUNTIFS($AE$12:$AE$19,A9,$AH$12:$AH$19,\"D\")+COUNTIFS($AI$12:$AI$19,A9,$AL$12:$AL$19,\"D\")+COUNTIFS($AE$21:$AE$28,A9,$AH$21:$AH$28,\"D\")+COUNTIFS($AI$21:$AI$28,A9,$AL$21:$AL$28,\"D\")+COUNTIFS($AE$30:$AE$37,A9,$AH$30:$AH$37,\"D\")+COUNTIFS($AI$30:$AI$37,A9,$AL$30:$AL$37,\"D\")))-Main!$Q$28","v":0},0,0,null,"P",1,0,0,"J",1,0,0,"L",1,0,0,"N",1,0,0,null,null,null,null,null,null,7,{"$f":"Main!B9","v":"G"},{"$f":"Main!C9","v":0},{"$f":"Main!D9","v":0},"D",{"$f":"Main!E9","v":"O"},{"$f":"Main!F9","v":0},{"$f":"Main!G9","v":0},"D",null,"G","O","G",null,0,0,4,null,null,"PJLN","PJLN",4,"H"]
[{"$f":"Main!AG10","v":"I"},{"$f":"Main!AI10","v":"Kees Struik, Grant Edmonds, Bruce Bridger"},{"$f":"Main!AH10","v":"RAY KURTZ"},{"$f":"((COUNTIFS($AE$3:$AE$10,A10,$AH$3:$AH$10,\"W\")+COUNTIFS($AI$3:$AI$10,A10,$AL$3:$AL$10,\"W\")+COUNTIFS($AE$12:$AE$19,A10,$AH$12:$AH$19,\"W\")+COUNTIFS($AI$12:$AI$19,A10,$AL$12:$AL$19,\"W\")+COUNTIFS($AE$21:$AE$28,A10,$AH$21:$AH$28,\"W\")+COUNTIFS($AI$21:$AI$28,A10,$AL$21:$AL$28,\"W\")+COUNTIFS($AE$30:$AE$37,A10,$AH$30:$AH$37,\"W\")+COUNTIFS($AI$30:$AI$37,A10,$AL$30:$AL$37,\"W\"))*3)+((COUNTIFS($AE$3:$AE$10,A10,$AH$3:$AH$10,\"L\")+COUNTIFS($AI$3:$AI$10,A10,$AL$3:$AL$10,\"L\")+COUNTIFS($AE$12:$AE$19,A10,$AH$12:$AH$19,\"L\")+COUNTIFS($AI$12:$AI$19,A10,$AL$12:$AL$19,\"L\")+COUNTIFS($AE$21:$AE$28,A10,$AH$21:$AH$28,\"L\")+COUNTIFS($AI$21:$AI$28,A10,$AL$21:$AL$28,\"L\")+COUNTIFS($AE$30:$AE$37,A10,$AH$30:$AH$37,\"L\")+COUNTIFS($AI$30:$AI$37,A10,$AL$30:$AL$37,\"L\"))*0)+((COUNTIFS($AE$3:$AE$10,A10,$AH$3:$AH$10,\"D\")+COUNTIFS($AI$3:$AI$10,A10,$AL$3:$AL$10,\"D\")+COUNTIFS($AE$12:$AE$19,A10,$AH$12:$AH$19,\"D\")+COUNTIFS($AI$12:$AI$19,A10,$AL$12:$AL$19,\"D\")+COUNTIFS($AE$21:$AE$28,A10,$AH$21:$AH$28,\"D\")+COUNTIFS($AI$21:$AI$28,A10,$AL$21:$AL$28,\"D\")+COUNTIFS($AE$30:$AE$37,A10,$AH$30:$AH$37,\"D\")+COUNTIFS($AI$30:$AI$37,A10,$AL$30:$AL$37,\"D\")))-Main!$Q$28","v":0},0,0,null,"A",1,{"$f":"SUMIF($AI$3:$AI$10,A10,$AJ$3:$AJ$10)-SUMIF($AI$3:$AI$10,A10,$AF$3:$AF$10)","v":0},0,"G",1,{"$f":"SUMIF($AI$12:$AI$19,A10,$AJ$12:$AJ$19)-SUMIF($AI$12:$AI$19,A10,$AF$12:$AF$19)","v":0},0,"E",{"$f":"(((COUNTIFS($AE$21:$AE$28,A10,$AH$21:$AH$28,\"W\")+COUNTIFS($AI$21:$AI$28,A10,$AL$21:$AL$28,\"W\")))*3)+((COUNTIFS($AE$21:$AE$28,A10,$AH$21:$AH$28,\"D\")+COUNTIFS($AI$21:$AI$28,A10,$AL$21:$AL$28,\"D\")))","v":1},{"$f":"SUMIF($AI$21:$AI$28,A10,$AJ$21:$AJ$28)-SUMIF($AI$21:$AI$28,A10,$AF$21:$AF$28)","v":0},0,"C",{"$f":"(((COUNTIFS($AE$30:$AE$37,A10,$AH$30:$AH$37,\"W\")+COUNTIFS($AI$30:$AI$37,A10,$AL$30:$AL$37,\"W\")))*3)+((COUNTIFS($AE$30:$AE$37,A10,$AH$30:$AH$37,\"D\")+COUNTIFS($AI$30:$AI$37,A10,$AL$30:$AL$37,\"D\")))","v":1},{"$f":"SUMIF($AI$30:$AI$37,A10,$AJ$30:$AJ$37)-SUMIF($AI$30:$AI$37,A10,$AF$30:$AF$37)","v":0},0,null,null,null,null,null,null,8,{"$f":"Main!B10","v":"H"},{"$f":"Main!C10","v":0},{"$f":"Main!D10","v":0},"D",{"$f":"Main!E10","v":"P"},{"$f":"Main!F10","v":0},{"$f":"Main!G10","v":0},"D",null,"H","P","H",null,0,0,4,null,null,"AGEC","AGEC",4,"I"]
[{"$f":"Main!AG11","v":"J"},{"$f":"Main!AI11","v":"Nathan Dodds, Michael Kinnear, Graham Kinnear"},{"$f":"Main!AH11","v":"PETER BLACKBURN"},{"$f":"((COUNTIFS($AE$3:$AE$10,A11,$AH$3:$AH$10,\"W\")+COUNTIFS($AI$3:$AI$10,A11,$AL$3:$AL$10,\"W\")+COUNTIFS($AE$12:$AE$19,A11,$AH$12:$AH$19,\"W\")+COUNTIFS($AI$12:$AI$19,A11,$AL$12:$AL$19,\"W\")+COUNTIFS($AE$21:$AE$28,A11,$AH$21:$AH$28,\"W\")+COUNTIFS($AI$21:$AI$28,A11,$AL$21:$AL$28,\"W\")+COUNTIFS($AE$30:$AE$37,A11,$AH$30:$AH$37,\"W\")+COUNTIFS($AI$30:$AI$37,A11,$AL$30:$AL$37,\"W\"))*3)+((COUNTIFS($AE$3:$AE$10,A11,$AH$3:$AH$10,\"L\")+COUNTIFS($AI$3:$AI$10,A11,$AL$3:$AL$10,\"L\")+COUNTIFS($AE$12:$AE$19,A11,$AH$12:$AH$19,\"L\")+COUNTIFS($AI$12:$AI$19,A11,$AL$12:$AL$19,\"L\")+COUNTIFS($AE$21:$AE$28,A11,$AH$21:$AH$28,\"L\")+COUNTIFS($AI$21:$AI$28,A11,$AL$21:$AL$28,\"L\")+COUNTIFS($AE$30:$AE$37,A11,$AH$30:$AH$37,\"L\")+COUNTIFS($AI$30:$AI$37,A11,$AL$30:$AL$37,\"L\"))*0)+((COUNTIFS($AE$3:$AE$10,A11,$AH$3:$AH$10,\"D\")+COUNTIFS($AI$3:$AI$10,A11,$AL$3:$AL$10,\"D\")+COUNTIFS($AE$12:$AE$19,A11,$AH$12:$AH$19,\"D\")+COUNTIFS($AI$12:$AI$19,A11,$AL$12:$AL$19,\"D\")+COUNTIFS($AE$21:$AE$28,A11,$AH$21:$AH$28,\"D\")+COUNTIFS($AI$21:$AI$28,A11,$AL$21:$AL$28,\"D\")+COUNTIFS($AE$30:$AE$37,A11,$AH$30:$AH$37,\"D\")+COUNTIFS($AI$30:$AI$37,A11,$AL$30:$AL$37,\"D\")))-Main!$Q$28","v":0},0,0,null,"B",1,{"$f":"SUMIF($AI$3:$AI$10,A11,$AJ$3:$AJ$10)-SUMIF($AI$3:$AI$10,A11,$AF$3:$AF$10)","v":0},0,"H",1,{"$f":"SUMIF($AI$12:$AI$19,A11,$AJ$12:$AJ$19)-SUMIF($AI$12:$AI$19,A11,$AF$12:$AF$19)","v":0},0,"F",{"$f":"(((COUNTIFS($AE$21:$AE$28,A11,$AH$21:$AH$28,\"W\")+COUNTIFS($AI$21:$AI$28,A11,$AL$21:$AL$28,\"W\")))*3)+((COUNTIFS($AE$21:$AE$28,A11,$AH$21:$AH$28,\"D\")+COUNTIFS($AI$21:$AI$28,A11,$AL$21:$AL$28,\"D\")))","v":1},{"$f":"SUMIF($AI$21:$AI$28,A11,$AJ$21:$AJ$28)-SUMIF($AI$21:$AI$28,A11,$AF$21:$AF$28)","v":0},0,"D",{"$f":"(((COUNTIFS($AE$30:$AE$37,A11,$AH$30:$AH$37,\"W\")+COUNTIFS($AI$30:$AI$37,A11,$AL$30:$AL$37,\"W\")))*3)+((COUNTIFS($AE$30:$AE$37,A11,$AH$30:$AH$37,\"D\")+COUNTIFS($AI$30:$AI$37,A11,$AL$30:$AL$37,\"D\")))","v":1},{"$f":"SUMIF($AI$30:$AI$37,A11,$AJ$30:$AJ$37)-SUMIF($AI$30:$AI$37,A11,$AF$30:$AF$37)","v":0},0,null,null,null,null,null,null,"ROUND 2",null,null,null,null,null,null,null,null,null,null,null,null,null,0,0,4,null,null,"BHFD","BHFD",4,"J"]
[{"$f":"Main!AG12","v":"K"},{"$f":"Main!AI12","v":"Rick Brunell, Ash Worland, Neil Moore"},{"$f":"Main!AH12","v":"TONY WHITEHORN"},{"$f":"((COUNTIFS($AE$3:$AE$10,A12,$AH$3:$AH$10,\"W\")+COUNTIFS($AI$3:$AI$10,A12,$AL$3:$AL$10,\"W\")+COUNTIFS($AE$12:$AE$19,A12,$AH$12:$AH$19,\"W\")+COUNTIFS($AI$12:$AI$19,A12,$AL$12:$AL$19,\"W\")+COUNTIFS($AE$21:$AE$28,A12,$AH$21:$AH$28,\"W\")+COUNTIFS($AI$21:$AI$28,A12,$AL$21:$AL$28,\"W\")+COUNTIFS($AE$30:$AE$37,A12,$AH$30:$AH$37,\"W\")+COUNTIFS($AI$30:$AI$37,A12,$AL$30:$AL$37,\"W\"))*3)+((COUNTIFS($AE$3:$AE$10,A12,$AH$3:$AH$10,\"L\")+COUNTIFS($AI$3:$AI$10,A12,$AL$3:$AL$10,\"L\")+COUNTIFS($AE$12:$AE$19,A12,$AH$12:$AH$19,\"L\")+COUNTIFS($AI$12:$AI$19,A12,$AL$12:$AL$19,\"L\")+COUNTIFS($AE$21:$AE$28,A12,$AH$21:$AH$28,\"L\")+COUNTIFS($AI$21:$AI$28,A12,$AL$21:$AL$28,\"L\")+COUNTIFS($AE$30:$AE$37,A12,$AH$30:$AH$37,\"L\")+COUNTIFS($AI$30:$AI$37,A12,$AL$30:$AL$37,\"L\"))*0)+((COUNTIFS($AE$3:$AE$10,A12,$AH$3:$AH$10,\"D\")+COUNTIFS($AI$3:$AI$10,A12,$AL$3:$AL$10,\"D\")+COUNTIFS($AE$12:$AE$19,A12,$AH$12:$AH$19,\"D\")+COUNTIFS($AI$12:$AI$19,A12,$AL$12:$AL$19,\"D\")+COUNTIFS($AE$21:$AE$28,A12,$AH$21:$AH$28,\"D\")+COUNTIFS($AI$21:$AI$28,A12,$AL$21:$AL$28,\"D\")+COUNTIFS($AE$30:$AE$37,A12,$AH$30:$AH$37,\"D\")+COUNTIFS($AI$30:$AI$37,A12,$AL$30:$AL$37,\"D\")))-Main!$Q$28","v":0},0,0,null,"C",1,0,0,"A",1,0,0,"G",1,0,0,"E",1,0,0,null,null,null,null,null,null,1,{"$f":"Main!J3","v":"H"},{"$f":"Main!K3","v":0},{"$f":"Main!L3","v":0},"D",{"$f":"Main!M3","v":"J"},{"$f":"Main!N3","v":0},{"$f":"Main!O3","v":0},"D",null,{"$f":"AE12","v":"H"},{"$f":"AI12","v":"J"},{"$f":"AE12","v":"H"},null,0,0,4,null,null,"CAGE","CAGE",4,"K"]
[{"$f":"Main!AG13","v":"L"},{"$f":"Main!AI13","v":"Gavin Milne, Jonathan Bye, Wayne Handley"},{"$f":"Main!AH13","v":"SHANE SPANN"},{"$f":"((COUNTIFS($AE$3:$AE$10,A13,$AH$3:$AH$10,\"W\")+COUNTIFS($AI$3:$AI$10,A13,$AL$3:$AL$10,\"W\")+COUNTIFS($AE$12:$AE$19,A13,$AH$12:$AH$19,\"W\")+COUNTIFS($AI$12:$AI$19,A13,$AL$12:$AL$19,\"W\")+COUNTIFS($AE$21:$AE$28,A13,$AH$21:$AH$28,\"W\")+COUNTIFS($AI$21:$AI$28,A13,$AL$21:$AL$28,\"W\")+COUNTIFS($AE$30:$AE$37,A13,$AH$30:$AH$37,\"W\")+COUNTIFS($AI$30:$AI$37,A13,$AL$30:$AL$37,\"W\"))*3)+((COUNTIFS($AE$3:$AE$10,A13,$AH$3:$AH$10,\"L\")+COUNTIFS($AI$3:$AI$10,A13,$AL$3:$AL$10,\"L\")+COUNTIFS($AE$12:$AE$19,A13,$AH$12:$AH$19,\"L\")+COUNTIFS($AI$12:$AI$19,A13,$AL$12:$AL$19,\"L\")+COUNTIFS($AE$21:$AE$28,A13,$AH$21:$AH$28,\"L\")+COUNTIFS($AI$21:$AI$28,A13,$AL$21:$AL$28,\"L\")+COUNTIFS($AE$30:$AE$37,A13,$AH$30:$AH$37,\"L\")+COUNTIFS($AI$30:$AI$37,A13,$AL$30:$AL$37,\"L\"))*0)+((COUNTIFS($AE$3:$AE$10,A13,$AH$3:$AH$10,\"D\")+COUNTIFS($AI$3:$AI$10,A13,$AL$3:$AL$10,\"D\")+COUNTIFS($AE$12:$AE$19,A13,$AH$12:$AH$19,\"D\")+COUNTIFS($AI$12:$AI$19,A13,$AL$12:$AL$19,\"D\")+COUNTIFS($AE$21:$AE$28,A13,$AH$21:$AH$28,\"D\")+COUNTIFS($AI$21:$AI$28,A13,$AL$21:$AL$28,\"D\")+COUNTIFS($AE$30:$AE$37,A13,$AH$30:$AH$37,\"D\")+COUNTIFS($AI$30:$AI$37,A13,$AL$30:$AL$37,\"D\")))-Main!$Q$28","v":0},0,0,null,"D",1,0,0,"B",1,0,0,"H",1,0,0,"F",1,0,0,null,null,null,null,null,null,2,{"$f":"Main!J4","v":"A"},{"$f":"Main!K4","v":0},{"$f":"Main!L4","v":0},"D",{"$f":"Main!M4","v":"K"},{"$f":"Main!N4","v":0},{"$f":"Main!O4","v":0},"D",null,"A","K","A",null,0,0,4,null,null,"DBHF","DBHF",4,"L"]
[{"$f":"Main!AG14","v":"M"},{"$f":"Main!AI14","v":"Col Stevens, Mick Coll, Steve Cassidy"},{"$f":"Main!AH14","v":"PETER MOLLOY"},{"$f":"((COUNTIFS($AE$3:$AE$10,A14,$AH$3:$AH$10,\"W\")+COUNTIFS($AI$3:$AI$10,A14,$AL$3:$AL$10,\"W\")+COUNTIFS($AE$12:$AE$19,A14,$AH$12:$AH$19,\"W\")+COUNTIFS($AI$12:$AI$19,A14,$AL$12:$AL$19,\"W\")+COUNTIFS($AE$21:$AE$28,A14,$AH$21:$AH$28,\"W\")+COUNTIFS($AI$21:$AI$28,A14,$AL$21:$AL$28,\"W\")+COUNTIFS($AE$30:$AE$37,A14,$AH$30:$AH$37,\"W\")+COUNTIFS($AI$30:$AI$37,A14,$AL$30:$AL$37,\"W\"))*3)+((COUNTIFS($AE$3:$AE$10,A14,$AH$3:$AH$10,\"L\")+COUNTIFS($AI$3:$AI$10,A14,$AL$3:$AL$10,\"L\")+COUNTIFS($AE$12:$AE$19,A14,$AH$12:$AH$19,\"L\")+COUNTIFS($AI$12:$AI$19,A14,$AL$12:$AL$19,\"L\")+COUNTIFS($AE$21:$AE$28,A14,$AH$21:$AH$28,\"L\")+COUNTIFS($AI$21:$AI$28,A14,$AL$21:$AL$28,\"L\")+COUNTIFS($AE$30:$AE$37,A14,$AH$30:$AH$37,\"L\")+COUNTIFS($AI$30:$AI$37,A14,$AL$30:$AL$37,\"L\"))*0)+((COUNTIFS($AE$3:$AE$10,A14,$AH$3:$AH$10,\"D\")+COUNTIFS($AI$3:$AI$10,A14,$AL$3:$AL$10,\"D\")+COUNTIFS($AE$12:$AE$19,A14,$AH$12:$AH$19,\"D\")+COUNTIFS($AI$12:$AI$19,A14,$AL$12:$AL$19,\"D\")+COUNTIFS($AE$21:$AE$28,A14,$AH$21:$AH$28,\"D\")+COUNTIFS($AI$21:$AI$28,A14,$AL$21:$AL$28,\"D\")+COUNTIFS($AE$30:$AE$37,A14,$AH$30:$AH$37,\"D\")+COUNTIFS($AI$30:$AI$37,A14,$AL$30:$AL$37,\"D\")))-Main!$Q$28","v":0},0,0,null,"E",1,0,0,"C",1,0,0,"A",1,0,0,"G",1,0,0,null,null,null,null,null,null,3,{"$f":"Main!J5","v":"B"},{"$f":"Main!K5","v":0},{"$f":"Main!L5","v":0},"D",{"$f":"Main!M5","v":"L"},{"$f":"Main!N5","v":0},{"$f":"Main!O5","v":0},"D",null,"B","L","B",null,0,0,4,null,null,"ECAG","ECAG",4,"M"]
[{"$f":"Main!AG15","v":"N"},{"$f":"Main!AI15","v":"Glenn Petrie, Paul Brunker, Wayne Pomfrett"},{"$f":"Main!AH15","v":"RUSSELL FRY"},{"$f":"((COUNTIFS($AE$3:$AE$10,A15,$AH$3:$AH$10,\"W\")+COUNTIFS($AI$3:$AI$10,A15,$AL$3:$AL$10,\"W\")+COUNTIFS($AE$12:$AE$19,A15,$AH$12:$AH$19,\"W\")+COUNTIFS($AI$12:$AI$19,A15,$AL$12:$AL$19,\"W\")+COUNTIFS($AE$21:$AE$28,A15,$AH$21:$AH$28,\"W\")+COUNTIFS($AI$21:$AI$28,A15,$AL$21:$AL$28,\"W\")+COUNTIFS($AE$30:$AE$37,A15,$AH$30:$AH$37,\"W\")+COUNTIFS($AI$30:$AI$37,A15,$AL$30:$AL$37,\"W\"))*3)+((COUNTIFS($AE$3:$AE$10,A15,$AH$3:$AH$10,\"L\")+COUNTIFS($AI$3:$AI$10,A15,$AL$3:$AL$10,\"L\")+COUNTIFS($AE$12:$AE$19,A15,$AH$12:$AH$19,\"L\")+COUNTIFS($AI$12:$AI$19,A15,$AL$12:$AL$19,\"L\")+COUNTIFS($AE$21:$AE$28,A15,$AH$21:$AH$28,\"L\")+COUNTIFS($AI$21:$AI$28,A15,$AL$21:$AL$28,\"L\")+COUNTIFS($AE$30:$AE$37,A15,$AH$30:$AH$37,\"L\")+COUNTIFS($AI$30:$AI$37,A15,$AL$30:$AL$37,\"L\"))*0)+((COUNTIFS($AE$3:$AE$10,A15,$AH$3:$AH$10,\"D\")+COUNTIFS($AI$3:$AI$10,A15,$AL$3:$AL$10,\"D\")+COUNTIFS($AE$12:$AE$19,A15,$AH$12:$AH$19,\"D\")+COUNTIFS($AI$12:$AI$19,A15,$AL$12:$AL$19,\"D\")+COUNTIFS($AE$21:$AE$28,A15,$AH$21:$AH$28,\"D\")+COUNTIFS($AI$21:$AI$28,A15,$AL$21:$AL$28,\"D\")+COUNTIFS($AE$30:$AE$37,A15,$AH$30:$AH$37,\"D\")+COUNTIFS($AI$30:$AI$37,A15,$AL$30:$AL$37,\"D\")))-Main!$Q$28","v":0},0,0,null,"F",1,0,0,"D",1,0,0,"B",1,0,0,"H",1,0,0,null,null,null,null,null,null,4,{"$f":"Main!J6","v":"C"},{"$f":"Main!K6","v":0},{"$f":"Main!L6","v":0},"D",{"$f":"Main!M6","v":"M"},{"$f":"Main!N6","v":0},{"$f":"Main!O6","v":0},"D",null,"C","M","C",null,0,0,4,null,null,"FDBH","FDBH",4,"N"]
[{"$f":"Main!AG16","v":"O"},{"$f":"Main!AI16","v":"Ben Walsh, Tony Gibson, Barry Jackson"},{"$f":"Main!AH16","v":"MICK WALSH"},{"$f":"((COUNTIFS($AE$3:$AE$10,A16,$AH$3:$AH$10,\"W\")+COUNTIFS($AI$3:$AI$10,A16,$AL$3:$AL$10,\"W\")+COUNTIFS($AE$12:$AE$19,A16,$AH$12:$AH$19,\"W\")+COUNTIFS($AI$12:$AI$19,A16,$AL$12:$AL$19,\"W\")+COUNTIFS($AE$21:$AE$28,A16,$AH$21:$AH$28,\"W\")+COUNTIFS($AI$21:$AI$28,A16,$AL$21:$AL$28,\"W\")+COUNTIFS($AE$30:$AE$37,A16,$AH$30:$AH$37,\"W\")+COUNTIFS($AI$30:$AI$37,A16,$AL$30:$AL$37,\"W\"))*3)+((COUNTIFS($AE$3:$AE$10,A16,$AH$3:$AH$10,\"L\")+COUNTIFS($AI$3:$AI$10,A16,$AL$3:$AL$10,\"L\")+COUNTIFS($AE$12:$AE$19,A16,$AH$12:$AH$19,\"L\")+COUNTIFS($AI$12:$AI$19,A16,$AL$12:$AL$19,\"L\")+COUNTIFS($AE$21:$AE$28,A16,$AH$21:$AH$28,\"L\")+COUNTIFS($AI$21:$AI$28,A16,$AL$21:$AL$28,\"L\")+COUNTIFS($AE$30:$AE$37,A16,$AH$30:$AH$37,\"L\")+COUNTIFS($AI$30:$AI$37,A16,$AL$30:$AL$37,\"L\"))*0)+((COUNTIFS($AE$3:$AE$10,A16,$AH$3:$AH$10,\"D\")+COUNTIFS($AI$3:$AI$10,A16,$AL$3:$AL$10,\"D\")+COUNTIFS($AE$12:$AE$19,A16,$AH$12:$AH$19,\"D\")+COUNTIFS($AI$12:$AI$19,A16,$AL$12:$AL$19,\"D\")+COUNTIFS($AE$21:$AE$28,A16,$AH$21:$AH$28,\"D\")+COUNTIFS($AI$21:$AI$28,A16,$AL$21:$AL$28,\"D\")+COUNTIFS($AE$30:$AE$37,A16,$AH$30:$AH$37,\"D\")+COUNTIFS($AI$30:$AI$37,A16,$AL$30:$AL$37,\"D\")))-Main!$Q$28","v":0},0,0,null,"G",1,0,0,"E",1,0,0,"C",1,0,0,"A",1,0,0,null,null,null,null,null,null,5,{"$f":"Main!J7","v":"D"},{"$f":"Main!K7","v":0},{"$f":"Main!L7","v":0},"D",{"$f":"Main!M7","v":"N"},{"$f":"Main!N7","v":0},{"$f":"Main!O7","v":0},"D",null,"D","N","D",null,0,0,4,null,null,"GECA","GECA",4,"O"]
[{"$f":"Main!AG17","v":"P"},{"$f":"Main!AI17","v":"Wally Kleidon, Mick Miller, George MacDonald"},{"$f":"Main!AH17","v":"BOB KINNANE"},{"$f":"((COUNTIFS($AE$3:$AE$10,A17,$AH$3:$AH$10,\"W\")+COUNTIFS($AI$3:$AI$10,A17,$AL$3:$AL$10,\"W\")+COUNTIFS($AE$12:$AE$19,A17,$AH$12:$AH$19,\"W\")+COUNTIFS($AI$12:$AI$19,A17,$AL$12:$AL$19,\"W\")+COUNTIFS($AE$21:$AE$28,A17,$AH$21:$AH$28,\"W\")+COUNTIFS($AI$21:$AI$28,A17,$AL$21:$AL$28,\"W\")+COUNTIFS($AE$30:$AE$37,A17,$AH$30:$AH$37,\"W\")+COUNTIFS($AI$30:$AI$37,A17,$AL$30:$AL$37,\"W\"))*3)+((COUNTIFS($AE$3:$AE$10,A17,$AH$3:$AH$10,\"L\")+COUNTIFS($AI$3:$AI$10,A17,$AL$3:$AL$10,\"L\")+COUNTIFS($AE$12:$AE$19,A17,$AH$12:$AH$19,\"L\")+COUNTIFS($AI$12:$AI$19,A17,$AL$12:$AL$19,\"L\")+COUNTIFS($AE$21:$AE$28,A17,$AH$21:$AH$28,\"L\")+COUNTIFS($AI$21:$AI$28,A17,$AL$21:$AL$28,\"L\")+COUNTIFS($AE$30:$AE$37,A17,$AH$30:$AH$37,\"L\")+COUNTIFS($AI$30:$AI$37,A17,$AL$30:$AL$37,\"L\"))*0)+((COUNTIFS($AE$3:$AE$10,A17,$AH$3:$AH$10,\"D\")+COUNTIFS($AI$3:$AI$10,A17,$AL$3:$AL$10,\"D\")+COUNTIFS($AE$12:$AE$19,A17,$AH$12:$AH$19,\"D\")+COUNTIFS($AI$12:$AI$19,A17,$AL$12:$AL$19,\"D\")+COUNTIFS($AE$21:$AE$28,A17,$AH$21:$AH$28,\"D\")+COUNTIFS($AI$21:$AI$28,A17,$AL$21:$AL$28,\"D\")+COUNTIFS($AE$30:$AE$37,A17,$AH$30:$AH$37,\"D\")+COUNTIFS($AI$30:$AI$37,A17,$AL$30:$AL$37,\"D\")))-Main!$Q$28","v":0},0,0,null,"H",1,0,0,"F",1,0,0,"D",1,0,0,"B",1,0,0,null,null,null,null,null,null,6,{"$f":"Main!J8","v":"E"},{"$f":"Main!K8","v":0},{"$f":"Main!L8","v":0},"D",{"$f":"Main!M8","v":"O"},{"$f":"Main!N8","v":0},{"$f":"Main!O8","v":0},"D",null,"E","O","E",null,0,0,4,null,null,"HFDB","HFDB",4,"P"]
[null,null,null,null,null,null,null,null,null,null,null,null,null,null,null,null,null,null,null,null,null,null,null,null,null,null,null,null,null,7,{"$f":"Main!J9","v":"F"},{"$f":"Main!K9","v":0},{"$f":"Main!L9","v":0},"D",{"$f":"Main!M9","v":"P"},{"$f":"Main!N9","v":0},{"$f":"Main!O9","v":0},"D",null,"F","P","F"]
[null,null,null,null,null,null,null,null,null,null,null,null,null,null,null,null,null,null,null,null,null,null,null,null,null,null,null,null,null,8,{"$f":"Main!J10","v":"G"},{"$f":"Main!K10","v":0},{"$f":"Main!L10","v":0},"D",{"$f":"Main!M10","v":"I"},{"$f":"Main!N10","v":0},{"$f":"Main!O10","v":0},"D",null,"G","I","G"]
[null,null,null,null,null,null,null,null,null,null,null,null,null,null,null,null,null,null,null,null,null,null,null,null,null,null,null,null,null,"ROUND 3"]
[null,null,null,null,null,null,null,null,null,null,null,null,null,null,null,null,null,null,null,null,null,null,null,null,null,null,null,null,null,1,{"$f":"Main!R3","v":"G"},{"$f":"Main!S3","v":0},{"$f":"Main!T3","v":0},"D",{"$f":"Main!U3","v":"K"},{"$f":"Main!V3","v":0},{"$f":"Main!W3","v":0},{"$f":"IF(AJ21>AF21,\"W\",IF(AJ21<AF21,\"L\",\"D\"))","v":"D"},null,{"$f":"AE21","v":"G"},{"$f":"AI21","v":"K"},{"$f":"AE21","v":"G"}]
[null,null,null,null,null,null,null,null,null,null,null,null,null,null,null,null,null,null,null,null,null,null,null,null,null,null,null,null,null,2,{"$f":"Main!R4","v":"H"},{"$f":"Main!S4","v":0},{"$f":"Main!T4","v":0},"D",{"$f":"Main!U4","v":"L"},{"$f":"Main!V4","v":0},{"$f":"Main!W4","v":0},{"$f":"IF(AJ22>AF22,\"W\",IF(AJ22<AF22,\"L\",\"D\"))","v":"D"},null,"H","L","H"]
[null,null,null,null,null,null,null,null,null,null,null,null,null,null,null,null,null,null,null,null,null,null,null,null,null,null,null,null,null,3,{"$f":"Main!R5","v":"A"},{"$f":"Main!S5","v":0},{"$f":"Main!T5","v":0},"D",{"$f":"Main!U5","v":"M"},{"$f":"Main!V5","v":0},{"$f":"Main!W5","v":0},"D",null,"A","M","A"]
[null,null,null,null,null,null,null,null,null,null,null,null,null,null,null,null,null,null,null,null,null,null,null,null,null,null,null,null,null,4,{"$f":"Main!R6","v":"B"},{"$f":"Main!S6","v":0},{"$f":"Main!T6","v":0},"D",{"$f":"Main!U6","v":"N"},{"$f":"Main!V6","v":0},{"$f":"Main!W6","v":0},"D",null,"B","N","B"]
[null,null,null,null,null,null,null,null,null,null,null,null,null,null,null,null,null,null,null,null,null,null,null,null,null,null,null,null,null,5,{"$f":"Main!R7","v":"C"},{"$f":"Main!S7","v":0},{"$f":"Main!T7","v":0},"D",{"$f":"Main!U7","v":"O"},{"$f":"Main!V7","v":0},{"$f":"Main!W7","v":0},"D",null,"C","O","C"]
[null,null,null,null,null,null,null,null,null,null,null,null,null,null,null,null,null,null,null,null,null,null,null,null,null,null,null,null,null,6,{"$f":"Main!R8","v":"D"},{"$f":"Main!S8","v":0},{"$f":"Main!T8","v":0},"D",{"$f":"Main!U8","v":"P"},{"$f":"Main!V8","v":0},{"$f":"Main!W8","v":0},"D",null,"D","P","D"]
[null,null,null,null,null,null,null,null,null,null,null,null,null,null,null,null,null,null,null,null,null,null,null,null,null,null,null,null,null,7,{"$f":"Main!R9","v":"E"},{"$f":"Main!S9","v":0},{"$f":"Main!T9","v":0},"D",{"$f":"Main!U9","v":"I"},{"$f":"Main!V9","v":0},{"$f":"Main!W9","v":0},"D",null,"E","I","E"]
[null,null,null,null,null,null,null,null,null,null,null,null,null,null,null,null,null,null,null,null,null,null,null,null,null,null,null,null,null,8,{"$f":"Main!R10","v":"F"},{"$f":"Main!S10","v":0},{"$f":"Main!T10","v":0},"D",{"$f":"Main!U10","v":"J"},{"$f":"Main!V10","v":0},{"$f":"Main!W10","v":0},"D",null,"F","J","F"]
[null,null,null,null,null,null,null,null,null,null,null,null,null,null,null,null,null,null,null,null,null,null,null,null,null,null,null,null,null,"ROUND 4"]
[null,null,null,null,null,null,null,null,null,null,null,null,null,null,null,null,null,null,null,null,null,null,null,null,null,null,null,null,null,1,{"$f":"Main!Z3","v":"F"},{"$f":"Main!AA3","v":0},{"$f":"Main!AB3","v":0},"D",{"$f":"Main!AC3","v":"L"},{"$f":"Main!AD3","v":0},{"$f":"Main!AE3","v":0},{"$f":"IF(AJ30>AF30,\"W\",IF(AJ30<AF30,\"L\",\"D\"))","v":"D"},null,{"$f":"AE30","v":"F"},{"$f":"AI30","v":"L"},{"$f":"AE30","v":"F"}]
[null,null,null,null,null,null,null,null,null,null,null,null,null,null,null,null,null,null,null,null,null,null,null,null,null,null,null,null,null,2,{"$f":"Main!Z4","v":"G"},{"$f":"Main!AA4","v":0},{"$f":"Main!AB4","v":0},"D",{"$f":"Main!AC4","v":"M"},{"$f":"Main!AD4","v":0},{"$f":"Main!AE4","v":0},{"$f":"IF(AJ31>AF31,\"W\",IF(AJ31<AF31,\"L\",\"D\"))","v":"D"},null,"G","M","G"]
[null,null,null,null,null,null,null,null,null,null,null,null,null,null,null,null,null,null,null,null,null,null,null,null,null,null,null,null,null,3,{"$f":"Main!Z5","v":"H"},{"$f":"Main!AA5","v":0},{"$f":"Main!AB5","v":0},"D",{"$f":"Main!AC5","v":"N"},{"$f":"Main!AD5","v":0},{"$f":"Main!AE5","v":0},"D",null,"H","N","H"]
[null,null,null,null,null,null,null,null,null,null,null,null,null,null,null,null,null,null,null,null,null,null,null,null,null,null,null,null,null,4,{"$f":"Main!Z6","v":"A"},{"$f":"Main!AA6","v":0},{"$f":"Main!AB6","v":0},"D",{"$f":"Main!AC6","v":"O"},{"$f":"Main!AD6","v":0},{"$f":"Main!AE6","v":0},"D",null,"A","O","A"]
[null,null,null,null,null,null,null,null,null,null,null,null,null,null,null,null,null,null,null,null,null,null,null,null,null,null,null,null,null,5,{"$f":"Main!Z7","v":"B"},{"$f":"Main!AA7","v":0},{"$f":"Main!AB7","v":0},"D",{"$f":"Main!AC7","v":"P"},{"$f":"Main!AD7","v":0},{"$f":"Main!AE7","v":0},"D",null,"B","P","B"]
[null,null,null,null,null,null,null,null,null,null,null,null,null,null,null,null,null,null,null,null,null,null,null,null,null,null,null,null,null,6,{"$f":"Main!Z8","v":"C"},{"$f":"Main!AA8","v":0},{"$f":"Main!AB8","v":0},"D",{"$f":"Main!AC8","v":"I"},{"$f":"Main!AD8","v":0},{"$f":"Main!AE8","v":0},"D",null,"C","I","C"]
[null,null,null,null,null,null,null,null,null,null,null,null,null,null,null,null,null,null,null,null,null,null,null,null,null,null,null,null,null,7,{"$f":"Main!Z9","v":"D"},{"$f":"Main!AA9","v":0},{"$f":"Main!AB9","v":0},"D",{"$f":"Main!AC9","v":"J"},{"$f":"Main!AD9","v":0},{"$f":"Main!AE9","v":0},"D",null,"D","J","D"]
[null,null,null,null,null,null,null,null,null,null,null,null,null,null,null,null,null,null,null,null,null,null,null,null,null,null,null,null,null,8,{"$f":"Main!Z10","v":"E"},{"$f":"Main!AA10","v":0},{"$f":"Main!AB10","v":0},"D",{"$f":"Main!AC10","v":"K"},{"$f":"Main!AD10","v":0},{"$f":"Main!AE10","v":0},"D",null,"E","K","E"]

{"sheet":"Data R5","index":10,"n_rows":17,"n_cols":27,"rows_kept":17,"cut":false,"hidden":false,"merged":[]}
["DIVISION","R5 RANK","TEAM","Vs","Lead, Second, Third","SKIP","Points","Margin","Ends",null,null,null,null,null,"Rink","T1","Score","Ends",null,"T2","Score","Ends"]
[1,{"$f":"COUNTIF($G$2:$G$7,\">\"&$G2)+COUNTIFS($G$2:$G$7,$G2,$H$2:$H$7,\">\"&$H2)+COUNTIFS($G$2:$G$7,$G2,$H$2:$H$7,$H2,$I$2:$I$7,\">\"&$I2)+1","v":1},{"$f":"'Progress R1-R4'!C3","v":"F"},{"$f":"IFERROR(VLOOKUP(C2,$Y$3:$Z$10,2,0),\"\") & IFERROR(VLOOKUP(C2,$Z$3:$AA$10,2,0),\"\")","v":""},{"$f":"'Progress R1-R4'!D3","v":"Dan Robinson, Jim Wallace, Adam Johnson"},{"$f":"'Progress R1-R4'!E3","v":"NOEL BRAND"},{"$f":"((COUNTIFS($P$3:$P$10,C2,$S$3:$S$10,\"W\")+COUNTIFS($T$3:$T$10,C2,$W$3:$W$10,\"W\"))*3)","v":0},{"$f":"SUMIF($P$3:$P$10,C2,$Q$3:$Q$10)-SUMIF($P$3:$P$10,C2,$U$3:$U$10)+SUMIF($T$3:$T$10,C2,$U$3:$U$10)-SUMIF($T$3:$T$10,C2,$Q$3:$Q$10)","v":0},{"$f":"SUMIF($P$3:$P$10,C2,$R$3:$R$10)+SUMIF($T$3:$T$10,C2,$V$3:$V$10)","v":0},null,null,null,null,null,"ROUND 5"]
[null,{"$f":"COUNTIF($G$2:$G$7,\">\"&$G3)+COUNTIFS($G$2:$G$7,$G3,$H$2:$H$7,\">\"&$H3)+COUNTIFS($G$2:$G$7,$G3,$H$2:$H$7,$H3,$I$2:$I$7,\">\"&$I3)+1","v":1},{"$f":"'Progress R1-R4'!C4","v":"I"},{"$f":"IFERROR(VLOOKUP(C3,$Y$3:$Z$10,2,0),\"\") & IFERROR(VLOOKUP(C3,$Z$3:$AA$10,2,0),\"\")","v":""},{"$f":"'Progress R1-R4'!D4","v":"Kees Struik, Grant Edmonds, Bruce Bridger"},{"$f":"'Progress R1-R4'!E4","v":"RAY KURTZ"},0,0,0,null,null,null,null,null,1,{"$f":"Main!B15","v":""},{"$f":"Main!C15","v":0},{"$f":"Main!D15","v":0},{"$f":"IF(Q3>U3,\"W\",IF(Q3<U3,\"L\",\"D\"))","v":"D"},{"$f":"Main!E15","v":""},{"$f":"Main!F15","v":0},{"$f":"Main!G15","v":0},{"$f":"IF(U3>Q3,\"W\",IF(U3<Q3,\"L\",\"D\"))","v":"D"},null,{"$f":"P3","v":""},{"$f":"T3","v":""},{"$f":"P3","v":""}]
[null,{"$f":"COUNTIF($G$2:$G$7,\">\"&$G4)+COUNTIFS($G$2:$G$7,$G4,$H$2:$H$7,\">\"&$H4)+COUNTIFS($G$2:$G$7,$G4,$H$2:$H$7,$H4,$I$2:$I$7,\">\"&$I4)+1","v":1},{"$f":"'Progress R1-R4'!C5","v":"P"},"",{"$f":"'Progress R1-R4'!D5","v":"Wally Kleidon, Mick Miller, George MacDonald"},{"$f":"'Progress R1-R4'!E5","v":"BOB KINNANE"},0,0,0,null,null,null,null,null,2,{"$f":"Main!B16","v":""},{"$f":"Main!C16","v":0},{"$f":"Main!D16","v":0},"D",{"$f":"Main!E16","v":""},{"$f":"Main!F16","v":0},{"$f":"Main!G16","v":0},"D",null,{"$f":"P4","v":""},{"$f":"T4","v":""},{"$f":"P4","v":""}]
[null,{"$f":"COUNTIF($G$2:$G$7,\">\"&$G5)+COUNTIFS($G$2:$G$7,$G5,$H$2:$H$7,\">\"&$H5)+COUNTIFS($G$2:$G$7,$G5,$H$2:$H$7,$H5,$I$2:$I$7,\">\"&$I5)+1","v":1},{"$f":"'Progress R1-R4'!C6","v":"H"},"",{"$f":"'Progress R1-R4'!D6","v":"David Peet, Don Orr, Mark Glew"},{"$f":"'Progress R1-R4'!E6","v":"WADE CRANSTON"},0,0,0,null,null,null,null,null,3,{"$f":"Main!B17","v":""},{"$f":"Main!C17","v":0},{"$f":"Main!D17","v":0},"D",{"$f":"Main!E17","v":""},{"$f":"Main!F17","v":0},{"$f":"Main!G17","v":0},"D",null,"","",""]
[null,{"$f":"COUNTIF($G$2:$G$7,\">\"&$G6)+COUNTIFS($G$2:$G$7,$G6,$H$2:$H$7,\">\"&$H6)+COUNTIFS($G$2:$G$7,$G6,$H$2:$H$7,$H6,$I$2:$I$7,\">\"&$I6)+1","v":1},{"$f":"'Progress R1-R4'!C7","v":"G"},"",{"$f":"'Progress R1-R4'!D7","v":"Peter Taft, Alan Bennett, Brian Archer"},{"$f":"'Progress R1-R4'!E7","v":"ROBBIE HARRIS"},0,0,0,null,null,null,null,null,4,{"$f":"Main!B18","v":""},{"$f":"Main!C18","v":0},{"$f":"Main!D18","v":0},"D",{"$f":"Main!E18","v":""},{"$f":"Main!F18","v":0},{"$f":"Main!G18","v":0},"D",null,"","",""]
[null,1,{"$f":"'Progress R1-R4'!C8","v":"N"},"",{"$f":"'Progress R1-R4'!D8","v":"Glenn Petrie, Paul Brunker, Wayne Pomfrett"},{"$f":"'Progress R1-R4'!E8","v":"RUSSELL FRY"},0,0,0,null,null,null,null,null,5,{"$f":"Main!B19","v":""},{"$f":"Main!C19","v":0},{"$f":"Main!D19","v":0},"D",{"$f":"Main!E19","v":""},{"$f":"Main!F19","v":0},{"$f":"Main!G19","v":0},"D",null,"","",""]
[2,{"$f":"COUNTIF($G$8:$G$13,\">\"&$G8)+COUNTIFS($G$8:$G$13,$G8,$H$8:$H$13,\">\"&$H8)+COUNTIFS($G$8:$G$13,$G8,$H$8:$H$13,$H8,$I$8:$I$13,\">\"&$I8)+7","v":7},{"$f":"'Progress R1-R4'!C9","v":"E"},"",{"$f":"'Progress R1-R4'!D9","v":"Kevin Tranberg, Barry Brown, Rickie Dunn"},{"$f":"'Progress R1-R4'!E9","v":"GERRY BOGERT"},0,0,0,null,null,null,null,null,6,{"$f":"Main!B20","v":""},{"$f":"Main!C20","v":0},{"$f":"Main!D20","v":0},"D",{"$f":"Main!E20","v":""},{"$f":"Main!F20","v":0},{"$f":"Main!G20","v":0},"D",null,"","",""]
[null,{"$f":"COUNTIF($G$8:$G$13,\">\"&$G9)+COUNTIFS($G$8:$G$13,$G9,$H$8:$H$13,\">\"&$H9)+COUNTIFS($G$8:$G$13,$G9,$H$8:$H$13,$H9,$I$8:$I$13,\">\"&$I9)+7","v":7},{"$f":"'Progress R1-R4'!C10","v":"A"},"",{"$f":"'Progress R1-R4'!D10","v":"Eddie Roberts, Steve Lane, Mick Pilcher"},{"$f":"'Progress R1-R4'!E10","v":"GREG THOMSEN"},0,0,0,null,null,null,null,null,7,{"$f":"Main!B21","v":""},{"$f":"Main!C21","v":0},{"$f":"Main!D21","v":0},"D",{"$f":"Main!E21","v":""},{"$f":"Main!F21","v":0},{"$f":"Main!G21","v":0},"D",null,"","",""]
[null,7,{"$f":"'Progress R1-R4'!C11","v":"C"},"",{"$f":"'Progress R1-R4'!D11","v":"David Cleary, Doug Wootton, Luke Kinnear"},{"$f":"'Progress R1-R4'!E11","v":"SCOTT KINNEAR"},0,0,0,null,null,null,null,null,8,{"$f":"Main!B22","v":""},{"$f":"Main!C22","v":0},{"$f":"Main!D22","v":0},"D",{"$f":"Main!E22","v":""},{"$f":"Main!F22","v":0},{"$f":"Main!G22","v":0},"D",null,"","",""]
[null,7,{"$f":"'Progress R1-R4'!C12","v":"M"},"",{"$f":"'Progress R1-R4'!D12","v":"Col Stevens, Mick Coll, Steve Cassidy"},{"$f":"'Progress R1-R4'!E12","v":"PETER MOLLOY"},0,0,0]
[null,7,{"$f":"'Progress R1-R4'!C13","v":"B"},"",{"$f":"'Progress R1-R4'!D13","v":"Sam Campion, A Matson, C Leeson"},{"$f":"'Progress R1-R4'!E13","v":"DENNIS MADDEN"},0,0,0]
[null,7,{"$f":"'Progress R1-R4'!C14","v":"J"},"",{"$f":"'Progress R1-R4'!D14","v":"Nathan Dodds, Michael Kinnear, Graham Kinnear"},{"$f":"'Progress R1-R4'!E14","v":"PETER BLACKBURN"},0,0,0]
[3,{"$f":"COUNTIF($G$14:$G$17,\">\"&$G14)+COUNTIFS($G$14:$G$17,$G14,$H$14:$H$17,\">\"&$H14)+COUNTIFS($G$14:$G$17,$G14,$H$14:$H$17,$H14,$I$14:$I$17,\">\"&$I14)+13","v":13},{"$f":"'Progress R1-R4'!C15","v":"L"},"",{"$f":"'Progress R1-R4'!D15","v":"Gavin Milne, Jonathan Bye, Wayne Handley"},{"$f":"'Progress R1-R4'!E15","v":"SHANE SPANN"},0,0,0]
[null,{"$f":"COUNTIF($G$14:$G$17,\">\"&$G15)+COUNTIFS($G$14:$G$17,$G15,$H$14:$H$17,\">\"&$H15)+COUNTIFS($G$14:$G$17,$G15,$H$14:$H$17,$H15,$I$14:$I$17,\">\"&$I15)+13","v":13},{"$f":"'Progress R1-R4'!C16","v":"O"},"",{"$f":"'Progress R1-R4'!D16","v":"Ben Walsh, Tony Gibson, Barry Jackson"},{"$f":"'Progress R1-R4'!E16","v":"MICK WALSH"},0,0,0]
[null,13,{"$f":"'Progress R1-R4'!C17","v":"D"},"",{"$f":"'Progress R1-R4'!D17","v":"Geoff Jolly, Bruce McLaughlin, Barry Paskins"},{"$f":"'Progress R1-R4'!E17","v":"NOEL WILSON"},0,0,0]
[null,13,{"$f":"'Progress R1-R4'!C18","v":"K"},"",{"$f":"'Progress R1-R4'!D18","v":"Rick Brunell, Ash Worland, Neil Moore"},{"$f":"'Progress R1-R4'!E18","v":"TONY WHITEHORN"},0,0,0]

{"sheet":"Data R6","index":11,"n_rows":17,"n_cols":27,"rows_kept":17,"cut":false,"hidden":false,"merged":[]}
["DIVISION","R5 RANK","R6 RANK","TEAM","Vs","Lead, Second, Third","SKIP","Points","Margin","Ends","Total Points","Total Margin","Total Ends",null,"Rink","T1","Score","Ends",null,"T2","Score","Ends"]
[1,{"$f":"'Data R5'!B2","v":1},{"$f":"COUNTIF($K$2:$K$7,\">\"&$K2)+COUNTIFS($K$2:$K$7,$K2,$L$2:$L$7,\">\"&$L2)+COUNTIFS($K$2:$K$7,$K2,$L$2:$L$7,$L2,$M$2:$M$7,\">\"&$M2)+1","v":1},{"$f":"'Data R5'!C2","v":"F"},{"$f":"IFERROR(VLOOKUP(D2,$Y$3:$Z$10,2,0),\"\") & IFERROR(VLOOKUP(D2,$Z$3:$AA$10,2,0),\"\")","v":""},{"$f":"'Data R5'!E2","v":"Dan Robinson, Jim Wallace, Adam Johnson"},{"$f":"'Data R5'!F2","v":"NOEL BRAND"},{"$f":"((COUNTIFS($P$3:$P$10,D2,$S$3:$S$10,\"W\")+COUNTIFS($T$3:$T$10,D2,$W$3:$W$10,\"W\"))*3)+(COUNTIFS($P$3:$P$10,D2,$S$3:$S$10,\"D\")+COUNTIFS($T$3:$T$10,D2,$W$3:$W$10,\"D\"))","v":0},{"$f":"SUMIF($P$3:$P$10,D2,$Q$3:$Q$10)-SUMIF($P$3:$P$10,D2,$U$3:$U$10)+SUMIF($T$3:$T$10,D2,$U$3:$U$10)-SUMIF($T$3:$T$10,D2,$Q$3:$Q$10)","v":0},{"$f":"SUMIF($P$3:$P$10,D2,$R$3:$R$10)+SUMIF($T$3:$T$10,D2,$V$3:$V$10)","v":0},{"$f":"H2+Table13[[#This Row],[Points]]","v":0},{"$f":"I2+Table13[[#This Row],[Margin]]","v":0},{"$f":"J2+Table13[[#This Row],[Ends]]","v":0},null,"ROUND 6"]
[null,{"$f":"'Data R5'!B3","v":1},{"$f":"COUNTIF($K$2:$K$7,\">\"&$K3)+COUNTIFS($K$2:$K$7,$K3,$L$2:$L$7,\">\"&$L3)+COUNTIFS($K$2:$K$7,$K3,$L$2:$L$7,$L3,$M$2:$M$7,\">\"&$M3)+1","v":1},{"$f":"'Data R5'!C3","v":"I"},"",{"$f":"'Data R5'!E3","v":"Kees Struik, Grant Edmonds, Bruce Bridger"},{"$f":"'Data R5'!F3","v":"RAY KURTZ"},0,0,0,{"$f":"H3+Table13[[#This Row],[Points]]","v":0},{"$f":"I3+Table13[[#This Row],[Margin]]","v":0},{"$f":"J3+Table13[[#This Row],[Ends]]","v":0},null,1,{"$f":"Main!J15","v":""},{"$f":"Main!K15","v":0},{"$f":"Main!L15","v":0},{"$f":"IF(Q3>U3,\"W\",IF(Q3<U3,\"L\",\"D\"))","v":"D"},{"$f":"Main!M15","v":""},{"$f":"Main!N15","v":0},{"$f":"Main!O15","v":0},{"$f":"IF(U3>Q3,\"W\",IF(U3<Q3,\"L\",\"D\"))","v":"D"},null,{"$f":"P3","v":""},{"$f":"T3","v":""},{"$f":"P3","v":""}]
[null,{"$f":"'Data R5'!B4","v":1},1,{"$f":"'Data R5'!C4","v":"P"},"",{"$f":"'Data R5'!E4","v":"Wally Kleidon, Mick Miller, George MacDonald"},{"$f":"'Data R5'!F4","v":"BOB KINNANE"},0,0,0,{"$f":"H4+Table13[[#This Row],[Points]]","v":0},{"$f":"I4+Table13[[#This Row],[Margin]]","v":0},{"$f":"J4+Table13[[#This Row],[Ends]]","v":0},null,2,{"$f":"Main!J16","v":""},{"$f":"Main!K16","v":0},{"$f":"Main!L16","v":0},"D",{"$f":"Main!M16","v":""},{"$f":"Main!N16","v":0},{"$f":"Main!O16","v":0},"D",null,{"$f":"P4","v":""},{"$f":"T4","v":""},{"$f":"P4","v":""}]
[null,{"$f":"'Data R5'!B5","v":1},1,{"$f":"'Data R5'!C5","v":"H"},"",{"$f":"'Data R5'!E5","v":"David Peet, Don Orr, Mark Glew"},{"$f":"'Data R5'!F5","v":"WADE CRANSTON"},0,0,0,{"$f":"H5+Table13[[#This Row],[Points]]","v":0},{"$f":"I5+Table13[[#This Row],[Margin]]","v":0},{"$f":"J5+Table13[[#This Row],[Ends]]","v":0},null,3,{"$f":"Main!J17","v":""},{"$f":"Main!K17","v":0},{"$f":"Main!L17","v":0},"D",{"$f":"Main!M17","v":""},{"$f":"Main!N17","v":0},{"$f":"Main!O17","v":0},"D",null,"","",""]
[null,{"$f":"'Data R5'!B6","v":1},1,{"$f":"'Data R5'!C6","v":"G"},"",{"$f":"'Data R5'!E6","v":"Peter Taft, Alan Bennett, Brian Archer"},{"$f":"'Data R5'!F6","v":"ROBBIE HARRIS"},{"$f":"((COUNTIFS($P$3:$P$10,D6,$S$3:$S$10,\"W\")+COUNTIFS($T$3:$T$10,D6,$W$3:$W$10,\"W\"))*3)+(COUNTIFS($P$3:$P$10,D6,$S$3:$S$10,\"D\")+COUNTIFS($T$3:$T$10,D6,$W$3:$W$10,\"D\"))","v":0},{"$f":"SUMIF($P$3:$P$10,D6,$Q$3:$Q$10)-SUMIF($P$3:$P$10,D6,$U$3:$U$10)+SUMIF($T$3:$T$10,D6,$U$3:$U$10)-SUMIF($T$3:$T$10,D6,$Q$3:$Q$10)","v":0},{"$f":"SUMIF($P$3:$P$10,D6,$R$3:$R$10)+SUMIF($T$3:$T$10,D6,$V$3:$V$10)","v":0},{"$f":"H6+Table13[[#This Row],[Points]]","v":0},{"$f":"I6+Table13[[#This Row],[Margin]]","v":0},{"$f":"J6+Table13[[#This Row],[Ends]]","v":0},null,4,{"$f":"Main!J18","v":""},{"$f":"Main!K18","v":0},{"$f":"Main!L18","v":0},"D",{"$f":"Main!M18","v":""},{"$f":"Main!N18","v":0},{"$f":"Main!O18","v":0},"D",null,"","",""]
[null,{"$f":"'Data R5'!B7","v":1},1,{"$f":"'Data R5'!C7","v":"N"},"",{"$f":"'Data R5'!E7","v":"Glenn Petrie, Paul Brunker, Wayne Pomfrett"},{"$f":"'Data R5'!F7","v":"RUSSELL FRY"},{"$f":"((COUNTIFS($P$3:$P$10,D7,$S$3:$S$10,\"W\")+COUNTIFS($T$3:$T$10,D7,$W$3:$W$10,\"W\"))*3)+((COUNTIFS($P$3:$P$10,D7,$S$3:$S$10,\"D\")+COUNTIFS($T$3:$T$10,D7,$W$3:$W$10,\"D\")))","v":0},0,0,{"$f":"H7+Table13[[#This Row],[Points]]","v":0},{"$f":"I7+Table13[[#This Row],[Margin]]","v":0},{"$f":"J7+Table13[[#This Row],[Ends]]","v":0},null,5,{"$f":"Main!J19","v":""},{"$f":"Main!K19","v":0},{"$f":"Main!L19","v":0},"D",{"$f":"Main!M19","v":""},{"$f":"Main!N19","v":0},{"$f":"Main!O19","v":0},"D",null,"","",""]
[2,{"$f":"'Data R5'!B8","v":7},{"$f":"COUNTIF($K$8:$K$13,\">\"&$K8)+COUNTIFS($K$8:$K$13,$K8,$L$8:$L$13,\">\"&$L8)+COUNTIFS($K$8:$K$13,$K8,$L$8:$L$13,$L8,$M$8:$M$13,\">\"&$M8)+7","v":7},{"$f":"'Data R5'!C8","v":"E"},"",{"$f":"'Data R5'!E8","v":"Kevin Tranberg, Barry Brown, Rickie Dunn"},{"$f":"'Data R5'!F8","v":"GERRY BOGERT"},0,0,0,{"$f":"H8+Table13[[#This Row],[Points]]","v":0},{"$f":"I8+Table13[[#This Row],[Margin]]","v":0},{"$f":"J8+Table13[[#This Row],[Ends]]","v":0},null,6,{"$f":"Main!J20","v":""},{"$f":"Main!K20","v":0},{"$f":"Main!L20","v":0},"D",{"$f":"Main!M20","v":""},{"$f":"Main!N20","v":0},{"$f":"Main!O20","v":0},"D",null,"","",""]
[null,{"$f":"'Data R5'!B9","v":7},{"$f":"COUNTIF($K$8:$K$13,\">\"&$K9)+COUNTIFS($K$8:$K$13,$K9,$L$8:$L$13,\">\"&$L9)+COUNTIFS($K$8:$K$13,$K9,$L$8:$L$13,$L9,$M$8:$M$13,\">\"&$M9)+7","v":7},{"$f":"'Data R5'!C9","v":"A"},"",{"$f":"'Data R5'!E9","v":"Eddie Roberts, Steve Lane, Mick Pilcher"},{"$f":"'Data R5'!F9","v":"GREG THOMSEN"},0,0,0,{"$f":"H9+Table13[[#This Row],[Points]]","v":0},{"$f":"I9+Table13[[#This Row],[Margin]]","v":0},{"$f":"J9+Table13[[#This Row],[Ends]]","v":0},null,7,{"$f":"Main!J21","v":""},{"$f":"Main!K21","v":0},{"$f":"Main!L21","v":0},"D",{"$f":"Main!M21","v":""},{"$f":"Main!N21","v":0},{"$f":"Main!O21","v":0},"D",null,"","",""]
[null,{"$f":"'Data R5'!B10","v":7},7,{"$f":"'Data R5'!C10","v":"C"},"",{"$f":"'Data R5'!E10","v":"David Cleary, Doug Wootton, Luke Kinnear"},{"$f":"'Data R5'!F10","v":"SCOTT KINNEAR"},0,0,0,{"$f":"H10+Table13[[#This Row],[Points]]","v":0},{"$f":"I10+Table13[[#This Row],[Margin]]","v":0},{"$f":"J10+Table13[[#This Row],[Ends]]","v":0},null,8,{"$f":"Main!J22","v":""},{"$f":"Main!K22","v":0},{"$f":"Main!L22","v":0},"D",{"$f":"Main!M22","v":""},{"$f":"Main!N22","v":0},{"$f":"Main!O22","v":0},"D",null,"","",""]
[null,{"$f":"'Data R5'!B11","v":7},7,{"$f":"'Data R5'!C11","v":"M"},"",{"$f":"'Data R5'!E11","v":"Col Stevens, Mick Coll, Steve Cassidy"},{"$f":"'Data R5'!F11","v":"PETER MOLLOY"},0,0,0,{"$f":"H11+Table13[[#This Row],[Points]]","v":0},{"$f":"I11+Table13[[#This Row],[Margin]]","v":0},{"$f":"J11+Table13[[#This Row],[Ends]]","v":0}]
[null,{"$f":"'Data R5'!B12","v":7},7,{"$f":"'Data R5'!C12","v":"B"},"",{"$f":"'Data R5'!E12","v":"Sam Campion, A Matson, C Leeson"},{"$f":"'Data R5'!F12","v":"DENNIS MADDEN"},0,0,0,{"$f":"H12+Table13[[#This Row],[Points]]","v":0},{"$f":"I12+Table13[[#This Row],[Margin]]","v":0},{"$f":"J12+Table13[[#This Row],[Ends]]","v":0}]
[null,{"$f":"'Data R5'!B13","v":7},7,{"$f":"'Data R5'!C13","v":"J"},"",{"$f":"'Data R5'!E13","v":"Nathan Dodds, Michael Kinnear, Graham Kinnear"},{"$f":"'Data R5'!F13","v":"PETER BLACKBURN"},0,0,0,{"$f":"H13+Table13[[#This Row],[Points]]","v":0},{"$f":"I13+Table13[[#This Row],[Margin]]","v":0},{"$f":"J13+Table13[[#This Row],[Ends]]","v":0}]
[3,{"$f":"'Data R5'!B14","v":13},{"$f":"COUNTIF($K$14:$K$17,\">\"&$K14)+COUNTIFS($K$14:$K$17,$K14,$L$14:$L$17,\">\"&$L14)+COUNTIFS($K$14:$K$17,$K14,$L$14:$L$17,$L14,$M$14:$M$17,\">\"&$M14)+13","v":13},{"$f":"'Data R5'!C14","v":"L"},"",{"$f":"'Data R5'!E14","v":"Gavin Milne, Jonathan Bye, Wayne Handley"},{"$f":"'Data R5'!F14","v":"SHANE SPANN"},0,0,0,{"$f":"H14+Table13[[#This Row],[Points]]","v":0},{"$f":"I14+Table13[[#This Row],[Margin]]","v":0},{"$f":"J14+Table13[[#This Row],[Ends]]","v":0}]
[null,{"$f":"'Data R5'!B15","v":13},{"$f":"COUNTIF($K$14:$K$17,\">\"&$K15)+COUNTIFS($K$14:$K$17,$K15,$L$14:$L$17,\">\"&$L15)+COUNTIFS($K$14:$K$17,$K15,$L$14:$L$17,$L15,$M$14:$M$17,\">\"&$M15)+13","v":13},{"$f":"'Data R5'!C15","v":"O"},"",{"$f":"'Data R5'!E15","v":"Ben Walsh, Tony Gibson, Barry Jackson"},{"$f":"'Data R5'!F15","v":"MICK WALSH"},0,0,0,{"$f":"H15+Table13[[#This Row],[Points]]","v":0},{"$f":"I15+Table13[[#This Row],[Margin]]","v":0},{"$f":"J15+Table13[[#This Row],[Ends]]","v":0}]
[null,{"$f":"'Data R5'!B16","v":13},13,{"$f":"'Data R5'!C16","v":"D"},"",{"$f":"'Data R5'!E16","v":"Geoff Jolly, Bruce McLaughlin, Barry Paskins"},{"$f":"'Data R5'!F16","v":"NOEL WILSON"},0,0,0,{"$f":"H16+Table13[[#This Row],[Points]]","v":0},{"$f":"I16+Table13[[#This Row],[Margin]]","v":0},{"$f":"J16+Table13[[#This Row],[Ends]]","v":0}]
[null,{"$f":"'Data R5'!B17","v":13},13,{"$f":"'Data R5'!C17","v":"K"},"",{"$f":"'Data R5'!E17","v":"Rick Brunell, Ash Worland, Neil Moore"},{"$f":"'Data R5'!F17","v":"TONY WHITEHORN"},0,0,0,{"$f":"H17+Table13[[#This Row],[Points]]","v":0},{"$f":"I17+Table13[[#This Row],[Margin]]","v":0},{"$f":"J17+Table13[[#This Row],[Ends]]","v":0}]

{"sheet":"Data R7","index":12,"n_rows":17,"n_cols":28,"rows_kept":17,"cut":false,"hidden":false,"merged":[]}
["DIVISION","R5 RANK","R6 RANK","R7 RANK","TEAM","Vs","Lead, Second, Third","SKIP","Points","Margin","Ends","Total Points","Total Margin","Total Ends",null,"Rink","T1","Score","Ends",null,"T2","Score","Ends"]
[1,{"$f":"'Data R5'!B2","v":1},{"$f":"Table134[[#This Row],[R6 RANK]]","v":1},{"$f":"COUNTIF($L$2:$L$7,\">\"&$L2)+COUNTIFS($L$2:$L$7,$L2,$M$2:$M$7,\">\"&$M2)+COUNTIFS($L$2:$L$7,$L2,$M$2:$M$7,$M2,$N$2:$N$7,\">\"&$N2)+1","v":1},{"$f":"'Data R5'!C2","v":"F"},{"$f":"IFERROR(VLOOKUP(E2,$Z$3:$AA$10,2,0),\"\") & IFERROR(VLOOKUP(E2,$AA$3:$AB$10,2,0),\"\")","v":""},{"$f":"'Data R5'!E2","v":"Dan Robinson, Jim Wallace, Adam Johnson"},{"$f":"'Data R5'!F2","v":"NOEL BRAND"},{"$f":"((COUNTIFS($Q$3:$Q$10,E2,$T$3:$T$10,\"W\")+COUNTIFS($U$3:$U$10,E2,$X$3:$X$10,\"W\"))*3)+(COUNTIFS($Q$3:$Q$10,E2,$T$3:$T$10,\"D\")+COUNTIFS($U$3:$U$10,E2,$X$3:$X$10,\"D\"))","v":0},{"$f":"SUMIF($Q$3:$Q$10,E2,$R$3:$R$10)-SUMIF($Q$3:$Q$10,E2,$V$3:$V$10)+SUMIF($U$3:$U$10,E2,$V$3:$V$10)-SUMIF($U$3:$U$10,E2,$R$3:$R$10)","v":0},{"$f":"SUMIF($Q$3:$Q$10,E2,$S$3:$S$10)+SUMIF($U$3:$U$10,E2,$W$3:$W$10)","v":0},{"$f":"Table1345[[#This Row],[Points]]+Table134[[#This Row],[Total Points]]","v":0},{"$f":"Table1345[[#This Row],[Margin]]+Table134[[#This Row],[Total Margin]]","v":0},{"$f":"Table1345[[#This Row],[Ends]]+Table134[[#This Row],[Total Ends]]","v":0},null,"ROUND 7"]
[null,{"$f":"'Data R5'!B3","v":1},{"$f":"Table134[[#This Row],[R6 RANK]]","v":1},{"$f":"COUNTIF($L$2:$L$7,\">\"&$L3)+COUNTIFS($L$2:$L$7,$L3,$M$2:$M$7,\">\"&$M3)+COUNTIFS($L$2:$L$7,$L3,$M$2:$M$7,$M3,$N$2:$N$7,\">\"&$N3)+1","v":1},{"$f":"'Data R5'!C3","v":"I"},"",{"$f":"'Data R5'!E3","v":"Kees Struik, Grant Edmonds, Bruce Bridger"},{"$f":"'Data R5'!F3","v":"RAY KURTZ"},0,0,0,{"$f":"Table1345[[#This Row],[Points]]+Table134[[#This Row],[Total Points]]","v":0},{"$f":"Table1345[[#This Row],[Margin]]+Table134[[#This Row],[Total Margin]]","v":0},{"$f":"Table1345[[#This Row],[Ends]]+Table134[[#This Row],[Total Ends]]","v":0},null,1,{"$f":"Main!R15","v":""},{"$f":"Main!S15","v":0},{"$f":"Main!T15","v":0},{"$f":"IF(R3>V3,\"W\",IF(R3<V3,\"L\",\"D\"))","v":"D"},{"$f":"Main!U15","v":""},{"$f":"Main!V15","v":0},{"$f":"Main!W15","v":0},{"$f":"IF(V3>R3,\"W\",IF(V3<R3,\"L\",\"D\"))","v":"D"},null,{"$f":"Q3","v":""},{"$f":"U3","v":""},{"$f":"Q3","v":""}]
[null,{"$f":"'Data R5'!B4","v":1},{"$f":"Table134[[#This Row],[R6 RANK]]","v":1},1,{"$f":"'Data R5'!C4","v":"P"},"",{"$f":"'Data R5'!E4","v":"Wally Kleidon, Mick Miller, George MacDonald"},{"$f":"'Data R5'!F4","v":"BOB KINNANE"},0,0,0,{"$f":"Table1345[[#This Row],[Points]]+Table134[[#This Row],[Total Points]]","v":0},{"$f":"Table1345[[#This Row],[Margin]]+Table134[[#This Row],[Total Margin]]","v":0},{"$f":"Table1345[[#This Row],[Ends]]+Table134[[#This Row],[Total Ends]]","v":0},null,2,{"$f":"Main!R16","v":""},{"$f":"Main!S16","v":0},{"$f":"Main!T16","v":0},"D",{"$f":"Main!U16","v":""},{"$f":"Main!V16","v":0},{"$f":"Main!W16","v":0},"D",null,{"$f":"Q4","v":""},{"$f":"U4","v":""},{"$f":"Q4","v":""}]
[null,{"$f":"'Data R5'!B5","v":1},{"$f":"Table134[[#This Row],[R6 RANK]]","v":1},1,{"$f":"'Data R5'!C5","v":"H"},"",{"$f":"'Data R5'!E5","v":"David Peet, Don Orr, Mark Glew"},{"$f":"'Data R5'!F5","v":"WADE CRANSTON"},0,0,0,{"$f":"Table1345[[#This Row],[Points]]+Table134[[#This Row],[Total Points]]","v":0},{"$f":"Table1345[[#This Row],[Margin]]+Table134[[#This Row],[Total Margin]]","v":0},{"$f":"Table1345[[#This Row],[Ends]]+Table134[[#This Row],[Total Ends]]","v":0},null,3,{"$f":"Main!R17","v":""},{"$f":"Main!S17","v":0},{"$f":"Main!T17","v":0},"D",{"$f":"Main!U17","v":""},{"$f":"Main!V17","v":0},{"$f":"Main!W17","v":0},"D",null,"","",""]
[null,{"$f":"'Data R5'!B6","v":1},{"$f":"Table134[[#This Row],[R6 RANK]]","v":1},1,{"$f":"'Data R5'!C6","v":"G"},"",{"$f":"'Data R5'!E6","v":"Peter Taft, Alan Bennett, Brian Archer"},{"$f":"'Data R5'!F6","v":"ROBBIE HARRIS"},{"$f":"((COUNTIFS($Q$3:$Q$10,E6,$T$3:$T$10,\"W\")+COUNTIFS($U$3:$U$10,E6,$X$3:$X$10,\"W\"))*3)+(COUNTIFS($Q$3:$Q$10,E6,$T$3:$T$10,\"D\")+COUNTIFS($U$3:$U$10,E6,$X$3:$X$10,\"D\"))","v":0},{"$f":"SUMIF($Q$3:$Q$10,E6,$R$3:$R$10)-SUMIF($Q$3:$Q$10,E6,$V$3:$V$10)+SUMIF($U$3:$U$10,E6,$V$3:$V$10)-SUMIF($U$3:$U$10,E6,$R$3:$R$10)","v":0},{"$f":"SUMIF($Q$3:$Q$10,E6,$S$3:$S$10)+SUMIF($U$3:$U$10,E6,$W$3:$W$10)","v":0},{"$f":"Table1345[[#This Row],[Points]]+Table134[[#This Row],[Total Points]]","v":0},{"$f":"Table1345[[#This Row],[Margin]]+Table134[[#This Row],[Total Margin]]","v":0},{"$f":"Table1345[[#This Row],[Ends]]+Table134[[#This Row],[Total Ends]]","v":0},null,4,{"$f":"Main!R18","v":""},{"$f":"Main!S18","v":0},{"$f":"Main!T18","v":0},"D",{"$f":"Main!U18","v":""},{"$f":"Main!V18","v":0},{"$f":"Main!W18","v":0},"D",null,"","",""]
[null,{"$f":"'Data R5'!B7","v":1},{"$f":"Table134[[#This Row],[R6 RANK]]","v":1},1,{"$f":"'Data R5'!C7","v":"N"},"",{"$f":"'Data R5'!E7","v":"Glenn Petrie, Paul Brunker, Wayne Pomfrett"},{"$f":"'Data R5'!F7","v":"RUSSELL FRY"},{"$f":"((COUNTIFS($Q$3:$Q$10,E7,$T$3:$T$10,\"W\")+COUNTIFS($U$3:$U$10,E7,$X$3:$X$10,\"W\"))*3)+((COUNTIFS($Q$3:$Q$10,E7,$T$3:$T$10,\"D\")+COUNTIFS($U$3:$U$10,E7,$X$3:$X$10,\"D\")))","v":0},0,0,{"$f":"Table1345[[#This Row],[Points]]+Table134[[#This Row],[Total Points]]","v":0},{"$f":"Table1345[[#This Row],[Margin]]+Table134[[#This Row],[Total Margin]]","v":0},{"$f":"Table1345[[#This Row],[Ends]]+Table134[[#This Row],[Total Ends]]","v":0},null,5,{"$f":"Main!R19","v":""},{"$f":"Main!S19","v":0},{"$f":"Main!T19","v":0},"D",{"$f":"Main!U19","v":""},{"$f":"Main!V19","v":0},{"$f":"Main!W19","v":0},"D",null,"","",""]
[2,{"$f":"'Data R5'!B8","v":7},{"$f":"Table134[[#This Row],[R6 RANK]]","v":7},{"$f":"COUNTIF($L$8:$L$13,\">\"&$L8)+COUNTIFS($L$8:$L$13,$L8,$M$8:$M$13,\">\"&$M8)+COUNTIFS($L$8:$L$13,$L8,$M$8:$M$13,$M8,$N$8:$N$13,\">\"&$N8)+7","v":7},{"$f":"'Data R5'!C8","v":"E"},"",{"$f":"'Data R5'!E8","v":"Kevin Tranberg, Barry Brown, Rickie Dunn"},{"$f":"'Data R5'!F8","v":"GERRY BOGERT"},0,0,0,{"$f":"Table1345[[#This Row],[Points]]+Table134[[#This Row],[Total Points]]","v":0},{"$f":"Table1345[[#This Row],[Margin]]+Table134[[#This Row],[Total Margin]]","v":0},{"$f":"Table1345[[#This Row],[Ends]]+Table134[[#This Row],[Total Ends]]","v":0},null,6,{"$f":"Main!R20","v":""},{"$f":"Main!S20","v":0},{"$f":"Main!T20","v":0},"D",{"$f":"Main!U20","v":""},{"$f":"Main!V20","v":0},{"$f":"Main!W20","v":0},"D",null,"","",""]
[null,{"$f":"'Data R5'!B9","v":7},{"$f":"Table134[[#This Row],[R6 RANK]]","v":7},{"$f":"COUNTIF($L$8:$L$13,\">\"&$L9)+COUNTIFS($L$8:$L$13,$L9,$M$8:$M$13,\">\"&$M9)+COUNTIFS($L$8:$L$13,$L9,$M$8:$M$13,$M9,$N$8:$N$13,\">\"&$N9)+7","v":7},{"$f":"'Data R5'!C9","v":"A"},"",{"$f":"'Data R5'!E9","v":"Eddie Roberts, Steve Lane, Mick Pilcher"},{"$f":"'Data R5'!F9","v":"GREG THOMSEN"},0,0,0,{"$f":"Table1345[[#This Row],[Points]]+Table134[[#This Row],[Total Points]]","v":0},{"$f":"Table1345[[#This Row],[Margin]]+Table134[[#This Row],[Total Margin]]","v":0},{"$f":"Table1345[[#This Row],[Ends]]+Table134[[#This Row],[Total Ends]]","v":0},null,7,{"$f":"Main!R21","v":""},{"$f":"Main!S21","v":0},{"$f":"Main!T21","v":0},"D",{"$f":"Main!U21","v":""},{"$f":"Main!V21","v":0},{"$f":"Main!W21","v":0},"D",null,"","",""]
[null,{"$f":"'Data R5'!B10","v":7},{"$f":"Table134[[#This Row],[R6 RANK]]","v":7},7,{"$f":"'Data R5'!C10","v":"C"},"",{"$f":"'Data R5'!E10","v":"David Cleary, Doug Wootton, Luke Kinnear"},{"$f":"'Data R5'!F10","v":"SCOTT KINNEAR"},0,0,0,{"$f":"Table1345[[#This Row],[Points]]+Table134[[#This Row],[Total Points]]","v":0},{"$f":"Table1345[[#This Row],[Margin]]+Table134[[#This Row],[Total Margin]]","v":0},{"$f":"Table1345[[#This Row],[Ends]]+Table134[[#This Row],[Total Ends]]","v":0},null,8,{"$f":"Main!R22","v":""},{"$f":"Main!S22","v":0},{"$f":"Main!T22","v":0},"D",{"$f":"Main!U22","v":""},{"$f":"Main!V22","v":0},{"$f":"Main!W22","v":0},"D",null,"","",""]
[null,{"$f":"'Data R5'!B11","v":7},{"$f":"Table134[[#This Row],[R6 RANK]]","v":7},7,{"$f":"'Data R5'!C11","v":"M"},"",{"$f":"'Data R5'!E11","v":"Col Stevens, Mick Coll, Steve Cassidy"},{"$f":"'Data R5'!F11","v":"PETER MOLLOY"},0,0,0,{"$f":"Table1345[[#This Row],[Points]]+Table134[[#This Row],[Total Points]]","v":0},{"$f":"Table1345[[#This Row],[Margin]]+Table134[[#This Row],[Total Margin]]","v":0},{"$f":"Table1345[[#This Row],[Ends]]+Table134[[#This Row],[Total Ends]]","v":0}]
[null,{"$f":"'Data R5'!B12","v":7},{"$f":"Table134[[#This Row],[R6 RANK]]","v":7},7,{"$f":"'Data R5'!C12","v":"B"},"",{"$f":"'Data R5'!E12","v":"Sam Campion, A Matson, C Leeson"},{"$f":"'Data R5'!F12","v":"DENNIS MADDEN"},0,0,0,{"$f":"Table1345[[#This Row],[Points]]+Table134[[#This Row],[Total Points]]","v":0},{"$f":"Table1345[[#This Row],[Margin]]+Table134[[#This Row],[Total Margin]]","v":0},{"$f":"Table1345[[#This Row],[Ends]]+Table134[[#This Row],[Total Ends]]","v":0}]
[null,{"$f":"'Data R5'!B13","v":7},{"$f":"Table134[[#This Row],[R6 RANK]]","v":7},7,{"$f":"'Data R5'!C13","v":"J"},"",{"$f":"'Data R5'!E13","v":"Nathan Dodds, Michael Kinnear, Graham Kinnear"},{"$f":"'Data R5'!F13","v":"PETER BLACKBURN"},0,0,0,{"$f":"Table1345[[#This Row],[Points]]+Table134[[#This Row],[Total Points]]","v":0},{"$f":"Table1345[[#This Row],[Margin]]+Table134[[#This Row],[Total Margin]]","v":0},{"$f":"Table1345[[#This Row],[Ends]]+Table134[[#This Row],[Total Ends]]","v":0}]
[3,{"$f":"'Data R5'!B14","v":13},{"$f":"Table134[[#This Row],[R6 RANK]]","v":13},{"$f":"COUNTIF($L$14:$L$17,\">\"&$L14)+COUNTIFS($L$14:$L$17,$L14,$M$14:$M$17,\">\"&$M14)+COUNTIFS($L$14:$L$17,$L14,$M$14:$M$17,$M14,$N$14:$N$17,\">\"&$N14)+13","v":13},{"$f":"'Data R5'!C14","v":"L"},"",{"$f":"'Data R5'!E14","v":"Gavin Milne, Jonathan Bye, Wayne Handley"},{"$f":"'Data R5'!F14","v":"SHANE SPANN"},0,0,0,{"$f":"Table1345[[#This Row],[Points]]+Table134[[#This Row],[Total Points]]","v":0},{"$f":"Table1345[[#This Row],[Margin]]+Table134[[#This Row],[Total Margin]]","v":0},{"$f":"Table1345[[#This Row],[Ends]]+Table134[[#This Row],[Total Ends]]","v":0}]
[null,{"$f":"'Data R5'!B15","v":13},{"$f":"Table134[[#This Row],[R6 RANK]]","v":13},{"$f":"COUNTIF($L$14:$L$17,\">\"&$L15)+COUNTIFS($L$14:$L$17,$L15,$M$14:$M$17,\">\"&$M15)+COUNTIFS($L$14:$L$17,$L15,$M$14:$M$17,$M15,$N$14:$N$17,\">\"&$N15)+13","v":13},{"$f":"'Data R5'!C15","v":"O"},"",{"$f":"'Data R5'!E15","v":"Ben Walsh, Tony Gibson, Barry Jackson"},{"$f":"'Data R5'!F15","v":"MICK WALSH"},0,0,0,{"$f":"Table1345[[#This Row],[Points]]+Table134[[#This Row],[Total Points]]","v":0},{"$f":"Table1345[[#This Row],[Margin]]+Table134[[#This Row],[Total Margin]]","v":0},{"$f":"Table1345[[#This Row],[Ends]]+Table134[[#This Row],[Total Ends]]","v":0}]
[null,{"$f":"'Data R5'!B16","v":13},{"$f":"Table134[[#This Row],[R6 RANK]]","v":13},13,{"$f":"'Data R5'!C16","v":"D"},"",{"$f":"'Data R5'!E16","v":"Geoff Jolly, Bruce McLaughlin, Barry Paskins"},{"$f":"'Data R5'!F16","v":"NOEL WILSON"},0,0,0,{"$f":"Table1345[[#This Row],[Points]]+Table134[[#This Row],[Total Points]]","v":0},{"$f":"Table1345[[#This Row],[Margin]]+Table134[[#This Row],[Total Margin]]","v":0},{"$f":"Table1345[[#This Row],[Ends]]+Table134[[#This Row],[Total Ends]]","v":0}]
[null,{"$f":"'Data R5'!B17","v":13},{"$f":"Table134[[#This Row],[R6 RANK]]","v":13},13,{"$f":"'Data R5'!C17","v":"K"},"",{"$f":"'Data R5'!E17","v":"Rick Brunell, Ash Worland, Neil Moore"},{"$f":"'Data R5'!F17","v":"TONY WHITEHORN"},0,0,0,{"$f":"Table1345[[#This Row],[Points]]+Table134[[#This Row],[Total Points]]","v":0},{"$f":"Table1345[[#This Row],[Margin]]+Table134[[#This Row],[Total Margin]]","v":0},{"$f":"Table1345[[#This Row],[Ends]]+Table134[[#This Row],[Total Ends]]","v":0}]

{"sheet":"Tally Data","index":13,"n_rows":19,"n_cols":71,"rows_kept":19,"cut":false,"hidden":false,"merged":[[0,4,0,64],[1,4,1,64],[2,0,2,2],[2,66,2,70]]}
[null,null,null,null,"MACKAY BOWLING CLUB INC."]
[null,null,null,null,{"$f":"Main!AH19 & \" DETAILED RESULTS\"","v":"TOURNAMENT NAME DETAILED RESULTS"}]
["Rinks",null,null,null,"SKIP","TEAM","R1 v team","Points","Margin","Ends ","Rank","R2 v team","Points","Margin","Ends ","Rank","Total Points","Total Margin","Total Ends","Over All Rank","R3 v team","Points","Margin","Ends ","Rank","Total Points","Total Margin","Total Ends","Over All Rank","R4 v team","Points","Margin","Ends ","Rank","Total Points","Total Margin","Total Ends","Over All Rank",null,"R5 DIVISION","TEAM","Vs","Points","Margin","Ends ","Rank","R6 DIVISION","TEAM","Vs","Points","Margin","Ends ","Total Points","Total Margin","Total Ends ","Rank","R7 DIVISION","TEAM","Vs","Points","Margin","Ends ","Total Points","Total Margin","Total Ends ",null,"Team opponents Saturday"]
[1,3,2,4,{"$f":"\" \"&Main!AH2","v":" GREG THOMSEN"},{"$f":"Main!AG2","v":"A"},{"$f":"'Data R1-R4'!H2","v":"I"},{"$f":"'Data R1-R4'!I2","v":1},{"$f":"'Data R1-R4'!J2","v":0},{"$f":"'Data R1-R4'!K2","v":0},{"$f":"COUNTIF($H$4:$H$19,\">\"&$H4)+COUNTIFS($H$4:$H$19,$H4,$I$4:$I$19,\">\"&$I4)+COUNTIFS($H$4:$H$19,$H4,$I$4:$I$19,$I4,$J$4:$J$19,\">\"&$J4)+1","v":1},{"$f":"'Data R1-R4'!L2","v":"K"},{"$f":"'Data R1-R4'!M2","v":1},{"$f":"'Data R1-R4'!N2","v":0},{"$f":"'Data R1-R4'!O2","v":0},{"$f":"COUNTIF($M$4:$M$19,\">\"&$M4)+COUNTIFS($M$4:$M$19,$M4,$N$4:$N$19,\">\"&$N4)+COUNTIFS($M$4:$M$19,$M4,$N$4:$N$19,$N4,$O$4:$O$19,\">\"&$O4)+1","v":1},{"$f":"H4+M4","v":2},{"$f":"I4+N4","v":0},{"$f":"J4+O4","v":0},{"$f":"COUNTIF($Q$4:$Q$19,\">\"&$Q4)+COUNTIFS($Q$4:$Q$19,$Q4,$R$4:$R$19,\">\"&$R4)+COUNTIFS($Q$4:$Q$19,$Q4,$R$4:$R$19,$R4,$S$4:$S$19,\">\"&$S4)+1","v":1},{"$f":"'Data R1-R4'!P2","v":"M"},{"$f":"'Data R1-R4'!Q2","v":1},{"$f":"'Data R1-R4'!R2","v":0},{"$f":"'Data R1-R4'!S2","v":0},{"$f":"COUNTIF($V$4:$V$19,\">\"&$V4)+COUNTIFS($V$4:$V$19,$V4,$W$4:$W$19,\">\"&$W4)+COUNTIFS($V$4:$V$19,$V4,$W$4:$W$19,$W4,$X$4:$X$19,\">\"&$X4)+1","v":1},{"$f":"H4+M4+V4","v":3},{"$f":"I4+N4+W4","v":0},{"$f":"J4+O4+X4","v":0},{"$f":"COUNTIF($Z$4:$Z$19,\">\"&$Z4)+COUNTIFS($Z$4:$Z$19,$Z4,$AA$4:$AA$19,\">\"&$AA4)+COUNTIFS($Z$4:$Z$19,$Z4,$AA$4:$AA$19,$AA4,$AB$4:$AB$19,\">\"&$AB4)+1","v":1},{"$f":"'Data R1-R4'!T2","v":"O"},{"$f":"'Data R1-R4'!U2","v":1},{"$f":"'Data R1-R4'!V2","v":0},{"$f":"'Data R1-R4'!W2","v":0},{"$f":"COUNTIF($AE$4:$AE$19,\">\"&$AE4)+COUNTIFS($AE$4:$AE$19,$AE4,$AF$4:$AF$19,\">\"&$AF4)+COUNTIFS($AE$4:$AE$19,$AE4,$AF$4:$AF$19,$AF4,$AG$4:$AG$19,\">\"&$AG4)+1","v":1},{"$f":"H4+M4+V4+AE4","v":4},{"$f":"I4+N4+W4+AF4","v":0},{"$f":"J4+O4+X4+AG4","v":0},{"$f":"COUNTIF($AI$4:$AI$19,\">\"&$AI4)+COUNTIFS($AI$4:$AI$19,$AI4,$AJ$4:$AJ$19,\">\"&$AJ4)+COUNTIFS($AI$4:$AI$19,$AI4,$AJ$4:$AJ$19,$AJ4,$AK$4:$AK$19,\">\"&$AK4)+1","v":1},null,1,{"$f":"'Progress R5'!C3","v":"I"},{"$f":"IFERROR(VLOOKUP(AO4,'Data R5'!$Y$3:$Z$10,2,0),\"\") & IFERROR(VLOOKUP(AO4,'Data R5'!$Z$3:$AA$10,2,0),\"\")","v":""},{"$f":"'Progress R5'!F3","v":3},{"$f":"'Progress R5'!G3","v":21},{"$f":"'Progress R5'!H3","v":10},1,1,{"$f":"'Progress R6'!C3","v":"I"},{"$f":"IFERROR(VLOOKUP(AV4,'Data R6'!$Y$3:$Z$10,2,0),\"\") & IFERROR(VLOOKUP(AV4,'Data R6'!$Z$3:$AA$10,2,0),\"\")","v":""},{"$f":"'Progress R6'!F3","v":0},{"$f":"'Progress R6'!G3","v":-13},{"$f":"'Progress R6'!H3","v":5},{"$f":"'Progress R6'!I3","v":3},{"$f":"'Progress R6'!J3","v":8},{"$f":"'Progress R6'!K3","v":15},1,1,{"$f":"'Progress R7'!C3","v":"P"},{"$f":"IFERROR(VLOOKUP(BF4,'Data R7'!$Z$3:$AA$10,2,0),\"\") & IFERROR(VLOOKUP(BF4,'Data R7'!$AA$3:$AB$10,2,0),\"\")","v":""},{"$f":"'Progress R7'!F3","v":3},{"$f":"'Progress R7'!G3","v":5},{"$f":"'Progress R7'!H3","v":9},{"$f":"'Progress R7'!I3","v":6},{"$f":"'Progress R7'!J3","v":11},{"$f":"'Progress R7'!K3","v":25},null,"A",{"$f":"G4","v":"I"},{"$f":"L4","v":"K"},{"$f":"U4","v":"M"},{"$f":"AD4","v":"O"}]
[7,5,8,6,{"$f":"\" \"&Main!AH3","v":" DENNIS MADDEN"},{"$f":"Main!AG3","v":"B"},{"$f":"'Data R1-R4'!H3","v":"J"},{"$f":"'Data R1-R4'!I3","v":1},{"$f":"'Data R1-R4'!J3","v":0},{"$f":"'Data R1-R4'!K3","v":0},{"$f":"COUNTIF($H$4:$H$19,\">\"&$H5)+COUNTIFS($H$4:$H$19,$H5,$I$4:$I$19,\">\"&$I5)+COUNTIFS($H$4:$H$19,$H5,$I$4:$I$19,$I5,$J$4:$J$19,\">\"&$J5)+1","v":1},{"$f":"'Data R1-R4'!L3","v":"L"},{"$f":"'Data R1-R4'!M3","v":1},{"$f":"'Data R1-R4'!N3","v":0},{"$f":"'Data R1-R4'!O3","v":0},{"$f":"COUNTIF($M$4:$M$19,\">\"&$M5)+COUNTIFS($M$4:$M$19,$M5,$N$4:$N$19,\">\"&$N5)+COUNTIFS($M$4:$M$19,$M5,$N$4:$N$19,$N5,$O$4:$O$19,\">\"&$O5)+1","v":1},{"$f":"H5+M5","v":2},{"$f":"I5+N5","v":0},{"$f":"J5+O5","v":0},{"$f":"COUNTIF($Q$4:$Q$19,\">\"&$Q5)+COUNTIFS($Q$4:$Q$19,$Q5,$R$4:$R$19,\">\"&$R5)+COUNTIFS($Q$4:$Q$19,$Q5,$R$4:$R$19,$R5,$S$4:$S$19,\">\"&$S5)+1","v":1},{"$f":"'Data R1-R4'!P3","v":"N"},{"$f":"'Data R1-R4'!Q3","v":1},{"$f":"'Data R1-R4'!R3","v":0},{"$f":"'Data R1-R4'!S3","v":0},{"$f":"COUNTIF($V$4:$V$19,\">\"&$V5)+COUNTIFS($V$4:$V$19,$V5,$W$4:$W$19,\">\"&$W5)+COUNTIFS($V$4:$V$19,$V5,$W$4:$W$19,$W5,$X$4:$X$19,\">\"&$X5)+1","v":1},{"$f":"H5+M5+V5","v":3},{"$f":"I5+N5+W5","v":0},{"$f":"J5+O5+X5","v":0},{"$f":"COUNTIF($Z$4:$Z$19,\">\"&$Z5)+COUNTIFS($Z$4:$Z$19,$Z5,$AA$4:$AA$19,\">\"&$AA5)+COUNTIFS($Z$4:$Z$19,$Z5,$AA$4:$AA$19,$AA5,$AB$4:$AB$19,\">\"&$AB5)+1","v":1},{"$f":"'Data R1-R4'!T3","v":"P"},{"$f":"'Data R1-R4'!U3","v":1},{"$f":"'Data R1-R4'!V3","v":0},{"$f":"'Data R1-R4'!W3","v":0},1,{"$f":"H5+M5+V5+AE5","v":4},{"$f":"I5+N5+W5+AF5","v":0},{"$f":"J5+O5+X5+AG5","v":0},{"$f":"COUNTIF($AI$4:$AI$19,\">\"&$AI5)+COUNTIFS($AI$4:$AI$19,$AI5,$AJ$4:$AJ$19,\">\"&$AJ5)+COUNTIFS($AI$4:$AI$19,$AI5,$AJ$4:$AJ$19,$AJ5,$AK$4:$AK$19,\">\"&$AK5)+1","v":1},null,1,{"$f":"'Progress R5'!C4","v":"H"},{"$f":"IFERROR(VLOOKUP(AO5,'Data R5'!$Y$3:$Z$10,2,0),\"\") & IFERROR(VLOOKUP(AO5,'Data R5'!$Z$3:$AA$10,2,0),\"\")","v":""},{"$f":"'Progress R5'!F4","v":3},{"$f":"'Progress R5'!G4","v":16},{"$f":"'Progress R5'!H4","v":9},2,1,{"$f":"'Progress R6'!C4","v":"P"},{"$f":"IFERROR(VLOOKUP(AV5,'Data R6'!$Y$3:$Z$10,2,0),\"\") & IFERROR(VLOOKUP(AV5,'Data R6'!$Z$3:$AA$10,2,0),\"\")","v":""},{"$f":"'Progress R6'!F4","v":3},{"$f":"'Progress R6'!G4","v":11},{"$f":"'Progress R6'!H4","v":10},{"$f":"'Progress R6'!I4","v":3},{"$f":"'Progress R6'!J4","v":6},{"$f":"'Progress R6'!K4","v":16},2,1,{"$f":"'Progress R7'!C4","v":"H"},{"$f":"IFERROR(VLOOKUP(BF5,'Data R7'!$Z$3:$AA$10,2,0),\"\") & IFERROR(VLOOKUP(BF5,'Data R7'!$AA$3:$AB$10,2,0),\"\")","v":""},{"$f":"'Progress R7'!F4","v":3},{"$f":"'Progress R7'!G4","v":4},{"$f":"'Progress R7'!H4","v":9},{"$f":"'Progress R7'!I4","v":6},{"$f":"'Progress R7'!J4","v":9},{"$f":"'Progress R7'!K4","v":23},null,"B","J","L","N",{"$f":"AD5","v":"P"}]
[6,8,5,7,{"$f":"\" \"&Main!AH4","v":" SCOTT KINNEAR"},{"$f":"Main!AG4","v":"C"},{"$f":"'Data R1-R4'!H4","v":"K"},{"$f":"'Data R1-R4'!I4","v":1},{"$f":"'Data R1-R4'!J4","v":0},{"$f":"'Data R1-R4'!K4","v":0},1,{"$f":"'Data R1-R4'!L4","v":"M"},{"$f":"'Data R1-R4'!M4","v":1},{"$f":"'Data R1-R4'!N4","v":0},{"$f":"'Data R1-R4'!O4","v":0},1,2,0,0,1,{"$f":"'Data R1-R4'!P4","v":"O"},{"$f":"'Data R1-R4'!Q4","v":1},{"$f":"'Data R1-R4'!R4","v":0},{"$f":"'Data R1-R4'!S4","v":0},1,3,0,0,1,{"$f":"'Data R1-R4'!T4","v":"I"},{"$f":"'Data R1-R4'!U4","v":1},{"$f":"'Data R1-R4'!V4","v":0},{"$f":"'Data R1-R4'!W4","v":0},1,4,0,0,1,null,1,{"$f":"'Progress R5'!C5","v":"N"},{"$f":"IFERROR(VLOOKUP(AO6,'Data R5'!$Y$3:$Z$10,2,0),\"\") & IFERROR(VLOOKUP(AO6,'Data R5'!$Z$3:$AA$10,2,0),\"\")","v":""},{"$f":"'Progress R5'!F5","v":3},{"$f":"'Progress R5'!G5","v":5},{"$f":"'Progress R5'!H5","v":9},3,1,{"$f":"'Progress R6'!C5","v":"H"},{"$f":"IFERROR(VLOOKUP(AV6,'Data R6'!$Y$3:$Z$10,2,0),\"\") & IFERROR(VLOOKUP(AV6,'Data R6'!$Z$3:$AA$10,2,0),\"\")","v":""},{"$f":"'Progress R6'!F5","v":0},{"$f":"'Progress R6'!G5","v":-11},{"$f":"'Progress R6'!H5","v":5},{"$f":"'Progress R6'!I5","v":3},{"$f":"'Progress R6'!J5","v":5},{"$f":"'Progress R6'!K5","v":14},3,1,{"$f":"'Progress R7'!C5","v":"F"},{"$f":"IFERROR(VLOOKUP(BF6,'Data R7'!$Z$3:$AA$10,2,0),\"\") & IFERROR(VLOOKUP(BF6,'Data R7'!$AA$3:$AB$10,2,0),\"\")","v":""},{"$f":"'Progress R7'!F5","v":3},{"$f":"'Progress R7'!G5","v":3},{"$f":"'Progress R7'!H5","v":6},{"$f":"'Progress R7'!I5","v":6},{"$f":"'Progress R7'!J5","v":0},{"$f":"'Progress R7'!K5","v":22},null,"C","K","M","O","I"]
[4,2,3,1,{"$f":"\" \"&Main!AH5","v":" NOEL WILSON"},{"$f":"Main!AG5","v":"D"},{"$f":"'Data R1-R4'!H5","v":"L"},{"$f":"'Data R1-R4'!I5","v":1},{"$f":"'Data R1-R4'!J5","v":0},{"$f":"'Data R1-R4'!K5","v":0},1,{"$f":"'Data R1-R4'!L5","v":"N"},{"$f":"'Data R1-R4'!M5","v":1},{"$f":"'Data R1-R4'!N5","v":0},{"$f":"'Data R1-R4'!O5","v":0},1,2,0,0,1,{"$f":"'Data R1-R4'!P5","v":"P"},{"$f":"'Data R1-R4'!Q5","v":1},{"$f":"'Data R1-R4'!R5","v":0},{"$f":"'Data R1-R4'!S5","v":0},1,3,0,0,1,{"$f":"'Data R1-R4'!T5","v":"J"},{"$f":"'Data R1-R4'!U5","v":1},{"$f":"'Data R1-R4'!V5","v":0},{"$f":"'Data R1-R4'!W5","v":0},1,4,0,0,1,null,1,{"$f":"'Progress R5'!C6","v":"P"},{"$f":"IFERROR(VLOOKUP(AO7,'Data R5'!$Y$3:$Z$10,2,0),\"\") & IFERROR(VLOOKUP(AO7,'Data R5'!$Z$3:$AA$10,2,0),\"\")","v":""},{"$f":"'Progress R5'!F6","v":0},{"$f":"'Progress R5'!G6","v":-5},{"$f":"'Progress R5'!H6","v":6},4,1,{"$f":"'Progress R6'!C6","v":"F"},{"$f":"IFERROR(VLOOKUP(AV7,'Data R6'!$Y$3:$Z$10,2,0),\"\") & IFERROR(VLOOKUP(AV7,'Data R6'!$Z$3:$AA$10,2,0),\"\")","v":""},{"$f":"'Progress R6'!F6","v":3},{"$f":"'Progress R6'!G6","v":13},{"$f":"'Progress R6'!H6","v":10},{"$f":"'Progress R6'!I6","v":3},{"$f":"'Progress R6'!J6","v":-3},{"$f":"'Progress R6'!K6","v":16},4,1,{"$f":"'Progress R7'!C6","v":"I"},{"$f":"IFERROR(VLOOKUP(BF7,'Data R7'!$Z$3:$AA$10,2,0),\"\") & IFERROR(VLOOKUP(BF7,'Data R7'!$AA$3:$AB$10,2,0),\"\")","v":""},{"$f":"'Progress R7'!F6","v":0},{"$f":"'Progress R7'!G6","v":-5},{"$f":"'Progress R7'!H6","v":6},{"$f":"'Progress R7'!I6","v":3},{"$f":"'Progress R7'!J6","v":3},{"$f":"'Progress R7'!K6","v":21},null,"D","L","N","P","J"]
[5,7,6,8,{"$f":"\" \"&Main!AH6","v":" GERRY BOGERT"},{"$f":"Main!AG6","v":"E"},{"$f":"'Data R1-R4'!H6","v":"M"},{"$f":"'Data R1-R4'!I6","v":1},{"$f":"'Data R1-R4'!J6","v":0},{"$f":"'Data R1-R4'!K6","v":0},1,{"$f":"'Data R1-R4'!L6","v":"O"},{"$f":"'Data R1-R4'!M6","v":1},{"$f":"'Data R1-R4'!N6","v":0},{"$f":"'Data R1-R4'!O6","v":0},1,2,0,0,1,{"$f":"'Data R1-R4'!P6","v":"I"},{"$f":"'Data R1-R4'!Q6","v":1},{"$f":"'Data R1-R4'!R6","v":0},{"$f":"'Data R1-R4'!S6","v":0},1,3,0,0,1,{"$f":"'Data R1-R4'!T6","v":"K"},{"$f":"'Data R1-R4'!U6","v":1},{"$f":"'Data R1-R4'!V6","v":0},{"$f":"'Data R1-R4'!W6","v":0},1,4,0,0,1,null,1,{"$f":"'Progress R5'!C7","v":"F"},{"$f":"IFERROR(VLOOKUP(AO8,'Data R5'!$Y$3:$Z$10,2,0),\"\") & IFERROR(VLOOKUP(AO8,'Data R5'!$Z$3:$AA$10,2,0),\"\")","v":""},{"$f":"'Progress R5'!F7","v":0},{"$f":"'Progress R5'!G7","v":-16},{"$f":"'Progress R5'!H7","v":6},5,1,{"$f":"'Progress R6'!C7","v":"N"},{"$f":"IFERROR(VLOOKUP(AV8,'Data R6'!$Y$3:$Z$10,2,0),\"\") & IFERROR(VLOOKUP(AV8,'Data R6'!$Z$3:$AA$10,2,0),\"\")","v":""},{"$f":"'Progress R6'!F7","v":0},{"$f":"'Progress R6'!G7","v":-8},{"$f":"'Progress R6'!H7","v":3},{"$f":"'Progress R6'!I7","v":3},{"$f":"'Progress R6'!J7","v":-3},{"$f":"'Progress R6'!K7","v":12},5,1,{"$f":"'Progress R7'!C7","v":"N"},{"$f":"IFERROR(VLOOKUP(BF8,'Data R7'!$Z$3:$AA$10,2,0),\"\") & IFERROR(VLOOKUP(BF8,'Data R7'!$AA$3:$AB$10,2,0),\"\")","v":""},{"$f":"'Progress R7'!F7","v":0},{"$f":"'Progress R7'!G7","v":-3},{"$f":"'Progress R7'!H7","v":9},{"$f":"'Progress R7'!I7","v":3},{"$f":"'Progress R7'!J7","v":-6},{"$f":"'Progress R7'!K7","v":21},null,"E","M","O","I","K"]
[2,4,3,1,{"$f":"\" \"&Main!AH7","v":" NOEL BRAND"},{"$f":"Main!AG7","v":"F"},{"$f":"'Data R1-R4'!H7","v":"N"},{"$f":"'Data R1-R4'!I7","v":1},{"$f":"'Data R1-R4'!J7","v":0},{"$f":"'Data R1-R4'!K7","v":0},1,{"$f":"'Data R1-R4'!L7","v":"P"},{"$f":"'Data R1-R4'!M7","v":1},{"$f":"'Data R1-R4'!N7","v":0},{"$f":"'Data R1-R4'!O7","v":0},1,2,0,0,1,{"$f":"'Data R1-R4'!P7","v":"J"},{"$f":"'Data R1-R4'!Q7","v":1},{"$f":"'Data R1-R4'!R7","v":0},{"$f":"'Data R1-R4'!S7","v":0},1,3,0,0,1,{"$f":"'Data R1-R4'!T7","v":"L"},{"$f":"'Data R1-R4'!U7","v":1},{"$f":"'Data R1-R4'!V7","v":0},{"$f":"'Data R1-R4'!W7","v":0},1,4,0,0,1,null,1,{"$f":"'Progress R5'!C8","v":"G"},{"$f":"IFERROR(VLOOKUP(AO9,'Data R5'!$Y$3:$Z$10,2,0),\"\") & IFERROR(VLOOKUP(AO9,'Data R5'!$Z$3:$AA$10,2,0),\"\")","v":""},{"$f":"'Progress R5'!F8","v":0},{"$f":"'Progress R5'!G8","v":-21},{"$f":"'Progress R5'!H8","v":5},6,1,{"$f":"'Progress R6'!C8","v":"G"},{"$f":"IFERROR(VLOOKUP(AV9,'Data R6'!$Y$3:$Z$10,2,0),\"\") & IFERROR(VLOOKUP(AV9,'Data R6'!$Z$3:$AA$10,2,0),\"\")","v":""},{"$f":"'Progress R6'!F8","v":3},{"$f":"'Progress R6'!G8","v":8},{"$f":"'Progress R6'!H8","v":12},{"$f":"'Progress R6'!I8","v":3},{"$f":"'Progress R6'!J8","v":-13},{"$f":"'Progress R6'!K8","v":17},6,1,{"$f":"'Progress R7'!C8","v":"G"},{"$f":"IFERROR(VLOOKUP(BF9,'Data R7'!$Z$3:$AA$10,2,0),\"\") & IFERROR(VLOOKUP(BF9,'Data R7'!$AA$3:$AB$10,2,0),\"\")","v":""},{"$f":"'Progress R7'!F8","v":0},{"$f":"'Progress R7'!G8","v":-4},{"$f":"'Progress R7'!H8","v":6},{"$f":"'Progress R7'!I8","v":3},{"$f":"'Progress R7'!J8","v":-17},{"$f":"'Progress R7'!K8","v":23},null,"F","N","P","J","L"]
[8,4,3,null,{"$f":"\" \"&Main!AH8","v":" ROBBIE HARRIS"},{"$f":"Main!AG8","v":"G"},{"$f":"'Data R1-R4'!H8","v":"O"},{"$f":"'Data R1-R4'!I8","v":1},{"$f":"'Data R1-R4'!J8","v":0},{"$f":"'Data R1-R4'!K8","v":0},1,{"$f":"'Data R1-R4'!L8","v":"I"},{"$f":"'Data R1-R4'!M8","v":1},{"$f":"'Data R1-R4'!N8","v":0},{"$f":"'Data R1-R4'!O8","v":0},1,2,0,0,1,{"$f":"'Data R1-R4'!P8","v":"K"},{"$f":"'Data R1-R4'!Q8","v":1},{"$f":"'Data R1-R4'!R8","v":0},{"$f":"'Data R1-R4'!S8","v":0},1,3,0,0,1,{"$f":"'Data R1-R4'!T8","v":"M"},{"$f":"'Data R1-R4'!U8","v":1},{"$f":"'Data R1-R4'!V8","v":0},{"$f":"'Data R1-R4'!W8","v":0},1,4,0,0,1,null,2,{"$f":"'Progress R5'!C9","v":"B"},{"$f":"IFERROR(VLOOKUP(AO10,'Data R5'!$Y$3:$Z$10,2,0),\"\") & IFERROR(VLOOKUP(AO10,'Data R5'!$Z$3:$AA$10,2,0),\"\")","v":""},{"$f":"'Progress R5'!F9","v":3},{"$f":"'Progress R5'!G9","v":7},{"$f":"'Progress R5'!H9","v":8},7,2,{"$f":"'Progress R6'!C9","v":"B"},{"$f":"IFERROR(VLOOKUP(AV10,'Data R6'!$Y$3:$Z$10,2,0),\"\") & IFERROR(VLOOKUP(AV10,'Data R6'!$Z$3:$AA$10,2,0),\"\")","v":""},{"$f":"'Progress R6'!F9","v":3},{"$f":"'Progress R6'!G9","v":13},{"$f":"'Progress R6'!H9","v":10},{"$f":"'Progress R6'!I9","v":6},{"$f":"'Progress R6'!J9","v":20},{"$f":"'Progress R6'!K9","v":18},7,2,{"$f":"'Progress R7'!C9","v":"B"},{"$f":"IFERROR(VLOOKUP(BF10,'Data R7'!$Z$3:$AA$10,2,0),\"\") & IFERROR(VLOOKUP(BF10,'Data R7'!$AA$3:$AB$10,2,0),\"\")","v":""},{"$f":"'Progress R7'!F9","v":3},{"$f":"'Progress R7'!G9","v":2},{"$f":"'Progress R7'!H9","v":7},{"$f":"'Progress R7'!I9","v":9},{"$f":"'Progress R7'!J9","v":22},{"$f":"'Progress R7'!K9","v":25},null,"G","O","I","K","M"]
[8,6,7,5,{"$f":"\" \"&Main!AH9","v":" WADE CRANSTON"},{"$f":"Main!AG9","v":"H"},{"$f":"'Data R1-R4'!H9","v":"P"},{"$f":"'Data R1-R4'!I9","v":1},{"$f":"'Data R1-R4'!J9","v":0},{"$f":"'Data R1-R4'!K9","v":0},1,{"$f":"'Data R1-R4'!L9","v":"J"},{"$f":"'Data R1-R4'!M9","v":1},{"$f":"'Data R1-R4'!N9","v":0},{"$f":"'Data R1-R4'!O9","v":0},1,2,0,0,1,{"$f":"'Data R1-R4'!P9","v":"L"},{"$f":"'Data R1-R4'!Q9","v":1},{"$f":"'Data R1-R4'!R9","v":0},{"$f":"'Data R1-R4'!S9","v":0},1,3,0,0,1,{"$f":"'Data R1-R4'!T9","v":"N"},{"$f":"'Data R1-R4'!U9","v":1},{"$f":"'Data R1-R4'!V9","v":0},{"$f":"'Data R1-R4'!W9","v":0},1,4,0,0,1,null,2,{"$f":"'Progress R5'!C10","v":"M"},{"$f":"IFERROR(VLOOKUP(AO11,'Data R5'!$Y$3:$Z$10,2,0),\"\") & IFERROR(VLOOKUP(AO11,'Data R5'!$Z$3:$AA$10,2,0),\"\")","v":""},{"$f":"'Progress R5'!F10","v":3},{"$f":"'Progress R5'!G10","v":4},{"$f":"'Progress R5'!H10","v":8},8,2,{"$f":"'Progress R6'!C10","v":"M"},{"$f":"IFERROR(VLOOKUP(AV11,'Data R6'!$Y$3:$Z$10,2,0),\"\") & IFERROR(VLOOKUP(AV11,'Data R6'!$Z$3:$AA$10,2,0),\"\")","v":""},{"$f":"'Progress R6'!F10","v":3},{"$f":"'Progress R6'!G10","v":5},{"$f":"'Progress R6'!H10","v":10},{"$f":"'Progress R6'!I10","v":6},{"$f":"'Progress R6'!J10","v":9},{"$f":"'Progress R6'!K10","v":18},8,2,{"$f":"'Progress R7'!C10","v":"M"},{"$f":"IFERROR(VLOOKUP(BF11,'Data R7'!$Z$3:$AA$10,2,0),\"\") & IFERROR(VLOOKUP(BF11,'Data R7'!$AA$3:$AB$10,2,0),\"\")","v":""},{"$f":"'Progress R7'!F10","v":0},{"$f":"'Progress R7'!G10","v":-2},{"$f":"'Progress R7'!H10","v":8},{"$f":"'Progress R7'!I10","v":6},{"$f":"'Progress R7'!J10","v":7},{"$f":"'Progress R7'!K10","v":26},null,"H","P","J","L","N"]
[1,2,4,3,{"$f":"\" \"&Main!AH10","v":" RAY KURTZ"},{"$f":"Main!AG10","v":"I"},{"$f":"'Data R1-R4'!H10","v":"A"},{"$f":"'Data R1-R4'!I10","v":1},{"$f":"'Data R1-R4'!J10","v":0},{"$f":"'Data R1-R4'!K10","v":0},1,{"$f":"'Data R1-R4'!L10","v":"G"},{"$f":"'Data R1-R4'!M10","v":1},{"$f":"'Data R1-R4'!N10","v":0},{"$f":"'Data R1-R4'!O10","v":0},1,2,0,0,1,{"$f":"'Data R1-R4'!P10","v":"E"},{"$f":"'Data R1-R4'!Q10","v":1},{"$f":"'Data R1-R4'!R10","v":0},{"$f":"'Data R1-R4'!S10","v":0},1,{"$f":"H12+M12+V12","v":3},{"$f":"I12+N12+W12","v":0},{"$f":"J12+O12+X12","v":0},1,{"$f":"'Data R1-R4'!T10","v":"C"},{"$f":"'Data R1-R4'!U10","v":1},{"$f":"'Data R1-R4'!V10","v":0},{"$f":"'Data R1-R4'!W10","v":0},1,4,0,0,1,null,2,{"$f":"'Progress R5'!C11","v":"J"},{"$f":"IFERROR(VLOOKUP(AO12,'Data R5'!$Y$3:$Z$10,2,0),\"\") & IFERROR(VLOOKUP(AO12,'Data R5'!$Z$3:$AA$10,2,0),\"\")","v":""},{"$f":"'Progress R5'!F11","v":3},{"$f":"'Progress R5'!G11","v":1},{"$f":"'Progress R5'!H11","v":9},9,2,{"$f":"'Progress R6'!C11","v":"A"},{"$f":"IFERROR(VLOOKUP(AV12,'Data R6'!$Y$3:$Z$10,2,0),\"\") & IFERROR(VLOOKUP(AV12,'Data R6'!$Z$3:$AA$10,2,0),\"\")","v":""},{"$f":"'Progress R6'!F11","v":3},{"$f":"'Progress R6'!G11","v":9},{"$f":"'Progress R6'!H11","v":10},{"$f":"'Progress R6'!I11","v":3},{"$f":"'Progress R6'!J11","v":2},{"$f":"'Progress R6'!K11","v":16},9,2,{"$f":"'Progress R7'!C11","v":"A"},{"$f":"IFERROR(VLOOKUP(BF12,'Data R7'!$Z$3:$AA$10,2,0),\"\") & IFERROR(VLOOKUP(BF12,'Data R7'!$AA$3:$AB$10,2,0),\"\")","v":""},{"$f":"'Progress R7'!F11","v":3},{"$f":"'Progress R7'!G11","v":4},{"$f":"'Progress R7'!H11","v":8},{"$f":"'Progress R7'!I11","v":6},{"$f":"'Progress R7'!J11","v":6},{"$f":"'Progress R7'!K11","v":24},null,"I",{"$f":"G12","v":"A"},{"$f":"L12","v":"G"},{"$f":"U12","v":"E"},{"$f":"AD12","v":"C"}]
[2,1,3,4,{"$f":"\" \"&Main!AH11","v":" PETER BLACKBURN"},{"$f":"Main!AG11","v":"J"},{"$f":"'Data R1-R4'!H11","v":"B"},{"$f":"'Data R1-R4'!I11","v":1},{"$f":"'Data R1-R4'!J11","v":0},{"$f":"'Data R1-R4'!K11","v":0},1,{"$f":"'Data R1-R4'!L11","v":"H"},{"$f":"'Data R1-R4'!M11","v":1},{"$f":"'Data R1-R4'!N11","v":0},{"$f":"'Data R1-R4'!O11","v":0},1,2,0,0,1,{"$f":"'Data R1-R4'!P11","v":"F"},{"$f":"'Data R1-R4'!Q11","v":1},{"$f":"'Data R1-R4'!R11","v":0},{"$f":"'Data R1-R4'!S11","v":0},1,3,0,0,1,{"$f":"'Data R1-R4'!T11","v":"D"},{"$f":"'Data R1-R4'!U11","v":1},{"$f":"'Data R1-R4'!V11","v":0},{"$f":"'Data R1-R4'!W11","v":0},1,4,0,0,1,null,2,{"$f":"'Progress R5'!C12","v":"C"},{"$f":"IFERROR(VLOOKUP(AO13,'Data R5'!$Y$3:$Z$10,2,0),\"\") & IFERROR(VLOOKUP(AO13,'Data R5'!$Z$3:$AA$10,2,0),\"\")","v":""},{"$f":"'Progress R5'!F12","v":0},{"$f":"'Progress R5'!G12","v":-1},{"$f":"'Progress R5'!H12","v":6},10,2,{"$f":"'Progress R6'!C12","v":"J"},{"$f":"IFERROR(VLOOKUP(AV13,'Data R6'!$Y$3:$Z$10,2,0),\"\") & IFERROR(VLOOKUP(AV13,'Data R6'!$Z$3:$AA$10,2,0),\"\")","v":""},{"$f":"'Progress R6'!F12","v":0},{"$f":"'Progress R6'!G12","v":-13},{"$f":"'Progress R6'!H12","v":5},{"$f":"'Progress R6'!I12","v":3},{"$f":"'Progress R6'!J12","v":-12},{"$f":"'Progress R6'!K12","v":14},10,2,{"$f":"'Progress R7'!C12","v":"E"},{"$f":"IFERROR(VLOOKUP(BF13,'Data R7'!$Z$3:$AA$10,2,0),\"\") & IFERROR(VLOOKUP(BF13,'Data R7'!$AA$3:$AB$10,2,0),\"\")","v":""},{"$f":"'Progress R7'!F12","v":3},{"$f":"'Progress R7'!G12","v":4},{"$f":"'Progress R7'!H12","v":9},{"$f":"'Progress R7'!I12","v":3},{"$f":"'Progress R7'!J12","v":-9},{"$f":"'Progress R7'!K12","v":21},null,"J","B","H","F","D"]
[6,5,7,8,{"$f":"\" \"&Main!AH12","v":" TONY WHITEHORN"},{"$f":"Main!AG12","v":"K"},{"$f":"'Data R1-R4'!H12","v":"C"},{"$f":"'Data R1-R4'!I12","v":1},{"$f":"'Data R1-R4'!J12","v":0},{"$f":"'Data R1-R4'!K12","v":0},1,{"$f":"'Data R1-R4'!L12","v":"A"},{"$f":"'Data R1-R4'!M12","v":1},{"$f":"'Data R1-R4'!N12","v":0},{"$f":"'Data R1-R4'!O12","v":0},1,2,0,0,1,{"$f":"'Data R1-R4'!P12","v":"G"},{"$f":"'Data R1-R4'!Q12","v":1},{"$f":"'Data R1-R4'!R12","v":0},{"$f":"'Data R1-R4'!S12","v":0},1,3,0,0,1,{"$f":"'Data R1-R4'!T12","v":"E"},{"$f":"'Data R1-R4'!U12","v":1},{"$f":"'Data R1-R4'!V12","v":0},{"$f":"'Data R1-R4'!W12","v":0},1,4,0,0,1,null,2,{"$f":"'Progress R5'!C13","v":"E"},{"$f":"IFERROR(VLOOKUP(AO14,'Data R5'!$Y$3:$Z$10,2,0),\"\") & IFERROR(VLOOKUP(AO14,'Data R5'!$Z$3:$AA$10,2,0),\"\")","v":""},{"$f":"'Progress R5'!F13","v":0},{"$f":"'Progress R5'!G13","v":-4},{"$f":"'Progress R5'!H13","v":7},11,2,{"$f":"'Progress R6'!C13","v":"C"},{"$f":"IFERROR(VLOOKUP(AV14,'Data R6'!$Y$3:$Z$10,2,0),\"\") & IFERROR(VLOOKUP(AV14,'Data R6'!$Z$3:$AA$10,2,0),\"\")","v":""},{"$f":"'Progress R6'!F13","v":0},{"$f":"'Progress R6'!G13","v":-5},{"$f":"'Progress R6'!H13","v":5},{"$f":"'Progress R6'!I13","v":0},{"$f":"'Progress R6'!J13","v":-6},{"$f":"'Progress R6'!K13","v":11},11,2,{"$f":"'Progress R7'!C13","v":"J"},{"$f":"IFERROR(VLOOKUP(BF14,'Data R7'!$Z$3:$AA$10,2,0),\"\") & IFERROR(VLOOKUP(BF14,'Data R7'!$AA$3:$AB$10,2,0),\"\")","v":""},{"$f":"'Progress R7'!F13","v":0},{"$f":"'Progress R7'!G13","v":-4},{"$f":"'Progress R7'!H13","v":6},{"$f":"'Progress R7'!I13","v":3},{"$f":"'Progress R7'!J13","v":-16},{"$f":"'Progress R7'!K13","v":20},null,"K","C","A","G","E"]
[3,4,2,1,{"$f":"\" \"&Main!AH13","v":" SHANE SPANN"},{"$f":"Main!AG13","v":"L"},{"$f":"'Data R1-R4'!H13","v":"D"},{"$f":"'Data R1-R4'!I13","v":1},{"$f":"'Data R1-R4'!J13","v":0},{"$f":"'Data R1-R4'!K13","v":0},1,{"$f":"'Data R1-R4'!L13","v":"B"},{"$f":"'Data R1-R4'!M13","v":1},{"$f":"'Data R1-R4'!N13","v":0},{"$f":"'Data R1-R4'!O13","v":0},1,2,0,0,1,{"$f":"'Data R1-R4'!P13","v":"H"},{"$f":"'Data R1-R4'!Q13","v":1},{"$f":"'Data R1-R4'!R13","v":0},{"$f":"'Data R1-R4'!S13","v":0},1,3,0,0,1,{"$f":"'Data R1-R4'!T13","v":"F"},{"$f":"'Data R1-R4'!U13","v":1},{"$f":"'Data R1-R4'!V13","v":0},{"$f":"'Data R1-R4'!W13","v":0},1,4,0,0,1,null,2,{"$f":"'Progress R5'!C14","v":"A"},{"$f":"IFERROR(VLOOKUP(AO15,'Data R5'!$Y$3:$Z$10,2,0),\"\") & IFERROR(VLOOKUP(AO15,'Data R5'!$Z$3:$AA$10,2,0),\"\")","v":""},{"$f":"'Progress R5'!F14","v":0},{"$f":"'Progress R5'!G14","v":-7},{"$f":"'Progress R5'!H14","v":6},10,2,{"$f":"'Progress R6'!C14","v":"E"},{"$f":"IFERROR(VLOOKUP(AV15,'Data R6'!$Y$3:$Z$10,2,0),\"\") & IFERROR(VLOOKUP(AV15,'Data R6'!$Z$3:$AA$10,2,0),\"\")","v":""},{"$f":"'Progress R6'!F14","v":0},{"$f":"'Progress R6'!G14","v":-9},{"$f":"'Progress R6'!H14","v":5},{"$f":"'Progress R6'!I14","v":0},{"$f":"'Progress R6'!J14","v":-13},{"$f":"'Progress R6'!K14","v":12},10,2,{"$f":"'Progress R7'!C14","v":"C"},{"$f":"IFERROR(VLOOKUP(BF15,'Data R7'!$Z$3:$AA$10,2,0),\"\") & IFERROR(VLOOKUP(BF15,'Data R7'!$AA$3:$AB$10,2,0),\"\")","v":""},{"$f":"'Progress R7'!F14","v":0},{"$f":"'Progress R7'!G14","v":-4},{"$f":"'Progress R7'!H14","v":7},{"$f":"'Progress R7'!I14","v":0},{"$f":"'Progress R7'!J14","v":-10},{"$f":"'Progress R7'!K14","v":18},null,"L","D","B","H","F"]
[5,6,8,7,{"$f":"\" \"&Main!AH14","v":" PETER MOLLOY"},{"$f":"Main!AG14","v":"M"},{"$f":"'Data R1-R4'!H14","v":"E"},{"$f":"'Data R1-R4'!I14","v":1},{"$f":"'Data R1-R4'!J14","v":0},{"$f":"'Data R1-R4'!K14","v":0},1,{"$f":"'Data R1-R4'!L14","v":"C"},{"$f":"'Data R1-R4'!M14","v":1},{"$f":"'Data R1-R4'!N14","v":0},{"$f":"'Data R1-R4'!O14","v":0},1,2,0,0,1,{"$f":"'Data R1-R4'!P14","v":"A"},{"$f":"'Data R1-R4'!Q14","v":1},{"$f":"'Data R1-R4'!R14","v":0},{"$f":"'Data R1-R4'!S14","v":0},1,3,0,0,1,{"$f":"'Data R1-R4'!T14","v":"G"},{"$f":"'Data R1-R4'!U14","v":1},{"$f":"'Data R1-R4'!V14","v":0},{"$f":"'Data R1-R4'!W14","v":0},1,4,0,0,1,null,3,{"$f":"'Progress R5'!C15","v":"D"},{"$f":"IFERROR(VLOOKUP(AO16,'Data R5'!$Y$3:$Z$10,2,0),\"\") & IFERROR(VLOOKUP(AO16,'Data R5'!$Z$3:$AA$10,2,0),\"\")","v":""},{"$f":"'Progress R5'!F15","v":3},{"$f":"'Progress R5'!G15","v":14},{"$f":"'Progress R5'!H15","v":8},13,3,{"$f":"'Progress R6'!C15","v":"L"},{"$f":"IFERROR(VLOOKUP(AV16,'Data R6'!$Y$3:$Z$10,2,0),\"\") & IFERROR(VLOOKUP(AV16,'Data R6'!$Z$3:$AA$10,2,0),\"\")","v":""},{"$f":"'Progress R6'!F15","v":3},{"$f":"'Progress R6'!G15","v":5},{"$f":"'Progress R6'!H15","v":9},{"$f":"'Progress R6'!I15","v":6},{"$f":"'Progress R6'!J15","v":8},{"$f":"'Progress R6'!K15","v":18},13,3,{"$f":"'Progress R7'!C15","v":"D"},{"$f":"IFERROR(VLOOKUP(BF16,'Data R7'!$Z$3:$AA$10,2,0),\"\") & IFERROR(VLOOKUP(BF16,'Data R7'!$AA$3:$AB$10,2,0),\"\")","v":""},{"$f":"'Progress R7'!F15","v":3},{"$f":"'Progress R7'!G15","v":7},{"$f":"'Progress R7'!H15","v":8},{"$f":"'Progress R7'!I15","v":6},{"$f":"'Progress R7'!J15","v":16},{"$f":"'Progress R7'!K15","v":22},null,"M","E","C","A","G"]
[4,3,1,2,{"$f":"\" \"&Main!AH15","v":" RUSSELL FRY"},{"$f":"Main!AG15","v":"N"},{"$f":"'Data R1-R4'!H15","v":"F"},{"$f":"'Data R1-R4'!I15","v":1},{"$f":"'Data R1-R4'!J15","v":0},{"$f":"'Data R1-R4'!K15","v":0},1,{"$f":"'Data R1-R4'!L15","v":"D"},{"$f":"'Data R1-R4'!M15","v":1},{"$f":"'Data R1-R4'!N15","v":0},{"$f":"'Data R1-R4'!O15","v":0},1,2,0,0,1,{"$f":"'Data R1-R4'!P15","v":"B"},{"$f":"'Data R1-R4'!Q15","v":1},{"$f":"'Data R1-R4'!R15","v":0},{"$f":"'Data R1-R4'!S15","v":0},1,3,0,0,1,{"$f":"'Data R1-R4'!T15","v":"H"},{"$f":"'Data R1-R4'!U15","v":1},{"$f":"'Data R1-R4'!V15","v":0},{"$f":"'Data R1-R4'!W15","v":0},1,4,0,0,1,null,3,{"$f":"'Progress R5'!C16","v":"L"},{"$f":"IFERROR(VLOOKUP(AO17,'Data R5'!$Y$3:$Z$10,2,0),\"\") & IFERROR(VLOOKUP(AO17,'Data R5'!$Z$3:$AA$10,2,0),\"\")","v":""},{"$f":"'Progress R5'!F16","v":3},{"$f":"'Progress R5'!G16","v":3},{"$f":"'Progress R5'!H16","v":9},14,3,{"$f":"'Progress R6'!C16","v":"D"},{"$f":"IFERROR(VLOOKUP(AV17,'Data R6'!$Y$3:$Z$10,2,0),\"\") & IFERROR(VLOOKUP(AV17,'Data R6'!$Z$3:$AA$10,2,0),\"\")","v":""},{"$f":"'Progress R6'!F16","v":0},{"$f":"'Progress R6'!G16","v":-5},{"$f":"'Progress R6'!H16","v":6},{"$f":"'Progress R6'!I16","v":3},{"$f":"'Progress R6'!J16","v":9},{"$f":"'Progress R6'!K16","v":14},14,3,{"$f":"'Progress R7'!C16","v":"L"},{"$f":"IFERROR(VLOOKUP(BF17,'Data R7'!$Z$3:$AA$10,2,0),\"\") & IFERROR(VLOOKUP(BF17,'Data R7'!$AA$3:$AB$10,2,0),\"\")","v":""},{"$f":"'Progress R7'!F16","v":0},{"$f":"'Progress R7'!G16","v":-18},{"$f":"'Progress R7'!H16","v":5},{"$f":"'Progress R7'!I16","v":6},{"$f":"'Progress R7'!J16","v":-10},{"$f":"'Progress R7'!K16","v":23},null,"N","F","D","B","H"]
[8,7,5,6,{"$f":"\" \"&Main!AH16","v":" MICK WALSH"},{"$f":"Main!AG16","v":"O"},{"$f":"'Data R1-R4'!H16","v":"G"},{"$f":"'Data R1-R4'!I16","v":1},{"$f":"'Data R1-R4'!J16","v":0},{"$f":"'Data R1-R4'!K16","v":0},1,{"$f":"'Data R1-R4'!L16","v":"E"},{"$f":"'Data R1-R4'!M16","v":1},{"$f":"'Data R1-R4'!N16","v":0},{"$f":"'Data R1-R4'!O16","v":0},1,2,0,0,1,{"$f":"'Data R1-R4'!P16","v":"C"},{"$f":"'Data R1-R4'!Q16","v":1},{"$f":"'Data R1-R4'!R16","v":0},{"$f":"'Data R1-R4'!S16","v":0},1,3,0,0,1,{"$f":"'Data R1-R4'!T16","v":"A"},{"$f":"'Data R1-R4'!U16","v":1},{"$f":"'Data R1-R4'!V16","v":0},{"$f":"'Data R1-R4'!W16","v":0},1,4,0,0,1,null,3,{"$f":"'Progress R5'!C17","v":"O"},{"$f":"IFERROR(VLOOKUP(AO18,'Data R5'!$Y$3:$Z$10,2,0),\"\") & IFERROR(VLOOKUP(AO18,'Data R5'!$Z$3:$AA$10,2,0),\"\")","v":""},{"$f":"'Progress R5'!F17","v":0},{"$f":"'Progress R5'!G17","v":-3},{"$f":"'Progress R5'!H17","v":6},15,3,{"$f":"'Progress R6'!C17","v":"O"},{"$f":"IFERROR(VLOOKUP(AV18,'Data R6'!$Y$3:$Z$10,2,0),\"\") & IFERROR(VLOOKUP(AV18,'Data R6'!$Z$3:$AA$10,2,0),\"\")","v":""},{"$f":"'Progress R6'!F17","v":3},{"$f":"'Progress R6'!G17","v":10},{"$f":"'Progress R6'!H17","v":9},{"$f":"'Progress R6'!I17","v":3},{"$f":"'Progress R6'!J17","v":7},{"$f":"'Progress R6'!K17","v":15},15,3,{"$f":"'Progress R7'!C17","v":"O"},{"$f":"IFERROR(VLOOKUP(BF18,'Data R7'!$Z$3:$AA$10,2,0),\"\") & IFERROR(VLOOKUP(BF18,'Data R7'!$AA$3:$AB$10,2,0),\"\")","v":""},{"$f":"'Progress R7'!F17","v":0},{"$f":"'Progress R7'!G17","v":-7},{"$f":"'Progress R7'!H17","v":7},{"$f":"'Progress R7'!I17","v":3},{"$f":"'Progress R7'!J17","v":0},{"$f":"'Progress R7'!K17","v":22},null,"O","G","E","C","A"]
[7,8,6,5,{"$f":"\" \"&Main!AH17","v":" BOB KINNANE"},{"$f":"Main!AG17","v":"P"},{"$f":"'Data R1-R4'!H17","v":"H"},{"$f":"'Data R1-R4'!I17","v":1},{"$f":"'Data R1-R4'!J17","v":0},{"$f":"'Data R1-R4'!K17","v":0},1,{"$f":"'Data R1-R4'!L17","v":"F"},{"$f":"'Data R1-R4'!M17","v":1},{"$f":"'Data R1-R4'!N17","v":0},{"$f":"'Data R1-R4'!O17","v":0},1,2,0,0,1,{"$f":"'Data R1-R4'!P17","v":"D"},{"$f":"'Data R1-R4'!Q17","v":1},{"$f":"'Data R1-R4'!R17","v":0},{"$f":"'Data R1-R4'!S17","v":0},1,3,0,0,1,{"$f":"'Data R1-R4'!T17","v":"B"},{"$f":"'Data R1-R4'!U17","v":1},{"$f":"'Data R1-R4'!V17","v":0},{"$f":"'Data R1-R4'!W17","v":0},1,4,0,0,1,null,3,{"$f":"'Progress R5'!C18","v":"K"},{"$f":"IFERROR(VLOOKUP(AO19,'Data R5'!$Y$3:$Z$10,2,0),\"\") & IFERROR(VLOOKUP(AO19,'Data R5'!$Z$3:$AA$10,2,0),\"\")","v":""},{"$f":"'Progress R5'!F18","v":0},{"$f":"'Progress R5'!G18","v":-14},{"$f":"'Progress R5'!H18","v":7},16,3,{"$f":"'Progress R6'!C18","v":"K"},{"$f":"IFERROR(VLOOKUP(AV19,'Data R6'!$Y$3:$Z$10,2,0),\"\") & IFERROR(VLOOKUP(AV19,'Data R6'!$Z$3:$AA$10,2,0),\"\")","v":""},{"$f":"'Progress R6'!F18","v":0},{"$f":"'Progress R6'!G18","v":-10},{"$f":"'Progress R6'!H18","v":6},{"$f":"'Progress R6'!I18","v":0},{"$f":"'Progress R6'!J18","v":-24},{"$f":"'Progress R6'!K18","v":13},16,3,{"$f":"'Progress R7'!C18","v":"K"},{"$f":"IFERROR(VLOOKUP(BF19,'Data R7'!$Z$3:$AA$10,2,0),\"\") & IFERROR(VLOOKUP(BF19,'Data R7'!$AA$3:$AB$10,2,0),\"\")","v":""},{"$f":"'Progress R7'!F18","v":3},{"$f":"'Progress R7'!G18","v":18},{"$f":"'Progress R7'!H18","v":10},{"$f":"'Progress R7'!I18","v":3},{"$f":"'Progress R7'!J18","v":-6},{"$f":"'Progress R7'!K18","v":23},null,"P","H","F","D","B"]